{"text_format":"3","workbook":"xlsx","n_sheets":2,"sheets":["Calorie Amoritization","Exercise Type Lookup"],"not_rendered":{"images":1,"defined_names":37},"read":"whole","date_system":"1900"}

{"sheet":"Calorie Amoritization","index":0,"n_rows":999,"n_cols":16,"rows_kept":999,"merged":[[1,8,1,13],[2,8,2,13],[4,2,4,4],[4,5,4,7],[4,8,4,9],[4,10,4,11],[6,2,6,3],[6,10,6,11],[6,12,6,13],[8,5,8,6],[8,8,8,9],[8,10,8,11],[8,12,8,13]]}
[null,"CALORIE AMORTIZATION SCHEDULE",{"$nulls":13}," "]
[null,null,{"$f":"IFERROR(CONCATENATE(\"ONLY \",DATEDIF(StartDate,TargetDate,\"m\"),\" MONTHS AND \", DATEDIF(StartDate,TargetDate,\"md\"),DayNo),\"\")","v":"ONLY 3 MONTHS AND 17 DAYS"},{"$nulls":5},{"$f":"IF(WeightGoal=\"Decrease\",\"It's not recommended that you decrease your calorie intake by more than 1000 calories below your daily calorie needs or consume less than \" & IF(Gender=\"Female\",\"1200 calories per day.\",\"1800 calories per day.\"),\"\")","v":"It's not recommended that you decrease your calorie intake by more than 1000 calories below your daily calorie needs or consume less than 1200 calories per day."}]
[null,null,{"$f":"IF(WeightGoal=\"Maintain\",\"\",\" UNTIL YOU REACH YOUR GOAL!\")","v":" UNTIL YOU REACH YOUR GOAL!"},{"$nulls":5},{"$f":"IF(WeightGoal=\"Maintain\",\"\",CONCATENATE(\"Goal target date is based on the recommended average weight \",IF(WeightGoal=\"Decrease\",\"loss \",\"gain \"),\"of \",IF(UnitOfMeasure=\"Imperial\",\"1 lb\",\".45 k\"),\" per week.\"))","v":"Goal target date is based on the recommended average weight loss of 1 lb per week."}]
[null,null,"ACTIVITY LEVEL",{"$nulls":5},"MEASUREMENT SYSTEM",null,"CURRENT WEIGHT",null,"AGE"]
[null,null,"MODERATE ACTIVITY ",null,null,{"$f":"VLOOKUP(Level,ExerciseTypes[],2,FALSE)","v":"EXERCISE 3-5 DAYS/WEEK"},null,null,"IMPERIAL",null,{"v":150,"d":"150.0"},null,34]
[null,null,"I WANT MY WEIGHT TO",{"$nulls":5},{"$f":"IF(Standard,\"HEIGHT IN FT\",\"HEIGHT IN M\")","v":"HEIGHT IN FT"},{"$f":"IF(Standard,\"INCHES\",\"CENTIMETERS\")","v":"INCHES"},"GOAL WEIGHT",null,"GENDER"]
[null,null,"DECREASE",{"$nulls":5},5,5,{"v":135,"d":"135.0"},null,"FEMALE"]
[null,null,"INITIAL DAILY CALORIE NEEDS",null,null,"INITIAL DAILY CALORIE INTAKE",null,null,{"$f":"IF(WeightGoal=\"Increase\",\"EXCESS CALORIES NEEDED\",\"CALORIES TO BURN\")","v":"CALORIES TO BURN"},null,"GOAL START DATE",null,"GOAL TARGET DATE"]
[null,null,{"$f":"IF(AllComplete,BMR*ActivityFactor,\"\")","v":{"v":2252.46,"d":"2252"}},null,null,{"$f":"IF(AllComplete,BMR*ActivityFactor+IF(WeightGoal=\"Maintain\",0,IF(WeightGoal=\"Decrease\",-500,IF(WeightGoal=\"Increase\",500))),\"\")","v":{"v":1752.46,"d":"1752"}},null,null,{"$f":"IF(WeightGoal=\"Maintain\",\"\",(WeightToLoseGain)*IF(Standard,1,2.2)*3500)","v":52500},null,{"$f":"TODAY()-5","v":"2013-02-20"},null,{"$f":"IF(WeightGoal=\"Maintain\",\"\",IF(AND(AllComplete,C13<>\"\"),MAX(C12:C999),\"Target date cannot be less than start date. Please check your entries.\"))","v":"2013-06-06"}]
[]
[null,null,"DATE","WEEK","DAY","WEIGHT","BMR","CAL CONSUMED","CAL BURNED",{"$f":"IF(WeightGoal=\"Increase\", \"EXTRA CAL\",\"CAL DEFICIT\")","v":"CAL DEFICIT"},"CAL REMAINING",{"$f":"IF(UnitOfMeasure=\"Imperial\",\"LBS REMAINING\",\"KGS REMAINING\")","v":"LBS REMAINING"},{"$f":"IF(WeightGoal=\"Increase\",\"GAIN\",\"LOSS\")","v":"LOSS"},"% OF GOAL"]
[null,null,{"$f":"IF(Maintain,\"\",StartDate)","v":"2013-02-20"},{"$f":"IF(Maintain,\"\",1)","v":1},{"$f":"IF(AND(ISNUMBER(K12),K12>0),1,\"\")","v":1},{"$f":"IF(Maintain,\"\",Weight)","v":{"v":150,"d":"150.0"}},{"$f":"IF(Maintain,\"\",IF(F12>0,RunningBMR,\"\"))","v":{"v":1453.2,"d":"1453"}},{"$f":"IF(Maintain,\"\",InitCalIntake)","v":{"v":1752.46,"d":"1752"}},{"$f":"IFERROR(G12*(ActivityFactor),\"\")","v":{"v":2252.46,"d":"2252"}},{"$f":"IFERROR(IF(WeightGoal=\"Increase\",H12-I12,I12-H12),\"\")","v":500},{"$f":"I9","v":52500},{"$f":"IFERROR(IF(Standard,K12/CalsPerPound,K12/CalsPerPound/2.2),\"\")","v":{"v":15,"d":"15.0"}},{"$f":"IFERROR(WeightToLoseGain-L12,\"\")","v":{"v":0,"d":"0.00"}},{"$f":"IF(Maintain,\"\",0%)","v":{"v":0,"d":"0%"}}]
[null,null,{"$f":"IFERROR(IF(L12>0,C12+1,\"\"),\"\")","v":"2013-02-21"},{"$f":"IFERROR(IF(E13<>\"\",IF(MOD(E13,7)=1,(E12/7)+1,\"\"),\"\"),\"\")","v":""},{"$f":"IFERROR(IF(L12>0,E12+1,\"\"),\"\")","v":2},{"$f":"IFERROR(IF($E13<>\"\",F12-(J12/CalsPerPound),\"\"),\"\")","v":{"v":149.85714285714286,"d":"149.9"}},{"$f":"IFERROR(RunningBMR,\"\")","v":{"v":1452.5785714285714,"d":"1453"}},{"$f":"IFERROR(IF(L12>0,G12*ActivityFactor+IF(WeightGoal=\"Maintain\",0,IF(WeightGoal=\"Decrease\",-500,IF(WeightGoal=\"Increase\",500))),\"\"),\"\")","v":{"v":1752.46,"d":"1752"}},{"$f":"IFERROR(G13*(ActivityFactor),\"\")","v":{"v":2251.4967857142856,"d":"2251"}},{"$f":"IFERROR(IF(WeightGoal=\"Increase\",H13-I13,I13-H13),\"\")","v":{"v":499.03678571428554,"d":"499"}},{"$f":"IFERROR(K12-J13,\"\")","v":{"v":52000.963214285715,"d":"52001"}},{"$f":"IFERROR(IF(Standard,K13/CalsPerPound,K13/CalsPerPound/2.2),\"\")","v":{"v":14.85741806122449,"d":"14.9"}},{"$f":"IFERROR(WeightToLoseGain-L13,\"\")","v":{"v":0.1425819387755105,"d":"0.14"}},{"$f":"IFERROR(IF(C12<>\"\",M13/(WeightToLoseGain),\"\"),\"\")","v":{"v":0.009505462585034034,"d":"1%"}}]
[null,null,"2013-02-22",{"$f":"IFERROR(IF(E14<>\"\",IF(MOD(E14,7)=1,(E13/7)+1,\"\"),\"\"),\"\")","v":""},3,{"v":149.71456091836734,"d":"149.7"},{"$f":"IFERROR(RunningBMR,\"\")","v":{"v":1451.9583399948979,"d":"1452"}},{"$f":"IFERROR(IF(L13>0,G13*ActivityFactor+IF(WeightGoal=\"Maintain\",0,IF(WeightGoal=\"Decrease\",-500,IF(WeightGoal=\"Increase\",500))),\"\"),\"\")","v":{"v":1751.4967857142856,"d":"1751"}},{"$f":"IFERROR(G14*(ActivityFactor),\"\")","v":{"v":2250.5354269920917,"d":"2251"}},{"$f":"IFERROR(IF(WeightGoal=\"Increase\",H14-I14,I14-H14),\"\")","v":{"v":499.03864127780616,"d":"499"}},{"$f":"IFERROR(K13-J14,\"\")","v":{"v":51501.92457300791,"d":"51502"}},{"$f":"IFERROR(IF(Standard,K14/CalsPerPound,K14/CalsPerPound/2.2),\"\")","v":{"v":14.714835592287976,"d":"14.7"}},{"$f":"IFERROR(WeightToLoseGain-L14,\"\")","v":{"v":0.2851644077120241,"d":"0.29"}},{"$f":"IFERROR(IF(C13<>\"\",M14/(WeightToLoseGain),\"\"),\"\")","v":{"v":0.01901096051413494,"d":"2%"}}]
[null,null,"2013-02-23","",4,{"v":149.57197844943082,"d":"149.6"},{"$f":"IFERROR(RunningBMR,\"\")","v":{"v":1451.338106255024,"d":"1451"}},{"$f":"IFERROR(IF(L14>0,G14*ActivityFactor+IF(WeightGoal=\"Maintain\",0,IF(WeightGoal=\"Decrease\",-500,IF(WeightGoal=\"Increase\",500))),\"\"),\"\")","v":{"v":1750.5354269920917,"d":"1751"}},{"$f":"IFERROR(G15*(ActivityFactor),\"\")","v":{"v":2249.5740646952872,"d":"2250"}},{"$f":"IFERROR(IF(WeightGoal=\"Increase\",H15-I15,I15-H15),\"\")","v":{"v":499.0386377031955,"d":"499"}},{"v":51002.885935304716,"d":"51003"},{"$f":"IFERROR(IF(Standard,K15/CalsPerPound,K15/CalsPerPound/2.2),\"\")","v":{"v":14.572253124372775,"d":"14.6"}},{"$f":"IFERROR(WeightToLoseGain-L15,\"\")","v":{"v":0.4277468756272249,"d":"0.43"}},{"$f":"IFERROR(IF(C14<>\"\",M15/(WeightToLoseGain),\"\"),\"\")","v":{"v":0.028516458375148327,"d":"3%"}}]
[null,null,"2013-02-24","",5,{"v":149.42939598151563,"d":"149.4"},{"$f":"IFERROR(RunningBMR,\"\")","v":{"v":1450.717872519593,"d":"1451"}},{"$f":"IFERROR(IF(L15>0,G15*ActivityFactor+IF(WeightGoal=\"Maintain\",0,IF(WeightGoal=\"Decrease\",-500,IF(WeightGoal=\"Increase\",500))),\"\"),\"\")","v":{"v":1749.5740646952872,"d":"1750"}},{"$f":"IFERROR(G16*(ActivityFactor),\"\")","v":{"v":2248.612702405369,"d":"2249"}},{"$f":"IFERROR(IF(WeightGoal=\"Increase\",H16-I16,I16-H16),\"\")","v":{"v":499.03863771008173,"d":"499"}},{"v":50503.847297594635,"d":"50504"},{"$f":"IFERROR(IF(Standard,K16/CalsPerPound,K16/CalsPerPound/2.2),\"\")","v":{"v":14.42967065645561,"d":"14.4"}},{"$f":"IFERROR(WeightToLoseGain-L16,\"\")","v":{"v":0.5703293435443904,"d":"0.57"}},{"$f":"IFERROR(IF(C15<>\"\",M16/(WeightToLoseGain),\"\"),\"\")","v":{"v":0.03802195623629269,"d":"4%"}}]
[null,null,"2013-02-25","",6,{"v":149.28681351359845,"d":"149.3"},{"$f":"IFERROR(RunningBMR,\"\")","v":{"v":1450.097638784153,"d":"1450"}},{"$f":"IFERROR(IF(L16>0,G16*ActivityFactor+IF(WeightGoal=\"Maintain\",0,IF(WeightGoal=\"Decrease\",-500,IF(WeightGoal=\"Increase\",500))),\"\"),\"\")","v":{"v":1748.612702405369,"d":"1749"}},{"$f":"IFERROR(G17*(ActivityFactor),\"\")","v":{"v":2247.6513401154375,"d":"2248"}},{"$f":"IFERROR(IF(WeightGoal=\"Increase\",H17-I17,I17-H17),\"\")","v":{"v":499.03863771006854,"d":"499"}},{"v":50004.80865988457,"d":"50005"},{"$f":"IFERROR(IF(Standard,K17/CalsPerPound,K17/CalsPerPound/2.2),\"\")","v":{"v":14.287088188538448,"d":"14.3"}},{"$f":"IFERROR(WeightToLoseGain-L17,\"\")","v":{"v":0.7129118114615522,"d":"0.71"}},{"$f":"IFERROR(IF(C16<>\"\",M17/(WeightToLoseGain),\"\"),\"\")","v":{"v":0.04752745409743682,"d":"5%"}}]
[null,null,"2013-02-26","",7,{"v":149.1442310456813,"d":"149.1"},{"$f":"IFERROR(RunningBMR,\"\")","v":{"v":1449.4774050487138,"d":"1449"}},{"$f":"IFERROR(IF(L17>0,G17*ActivityFactor+IF(WeightGoal=\"Maintain\",0,IF(WeightGoal=\"Decrease\",-500,IF(WeightGoal=\"Increase\",500))),\"\"),\"\")","v":{"v":1747.6513401154375,"d":"1748"}},{"$f":"IFERROR(G18*(ActivityFactor),\"\")","v":{"v":2246.6899778255065,"d":"2247"}},{"$f":"IFERROR(IF(WeightGoal=\"Increase\",H18-I18,I18-H18),\"\")","v":{"v":499.038637710069,"d":"499"}},{"v":49505.7700221745,"d":"49506"},{"$f":"IFERROR(IF(Standard,K18/CalsPerPound,K18/CalsPerPound/2.2),\"\")","v":{"v":14.144505720621286,"d":"14.1"}},{"$f":"IFERROR(WeightToLoseGain-L18,\"\")","v":{"v":0.8554942793787141,"d":"0.86"}},{"$f":"IFERROR(IF(C17<>\"\",M18/(WeightToLoseGain),\"\"),\"\")","v":{"v":0.05703295195858094,"d":"6%"}}]
[null,null,"2013-02-27",2,8,{"v":149.00164857776414,"d":"149.0"},{"$f":"IFERROR(RunningBMR,\"\")","v":{"v":1448.857171313274,"d":"1449"}},{"$f":"IFERROR(IF(L18>0,G18*ActivityFactor+IF(WeightGoal=\"Maintain\",0,IF(WeightGoal=\"Decrease\",-500,IF(WeightGoal=\"Increase\",500))),\"\"),\"\")","v":{"v":1746.6899778255065,"d":"1747"}},{"$f":"IFERROR(G19*(ActivityFactor),\"\")","v":{"v":2245.7286155355746,"d":"2246"}},{"$f":"IFERROR(IF(WeightGoal=\"Increase\",H19-I19,I19-H19),\"\")","v":{"v":499.0386377100681,"d":"499"}},{"v":49006.73138446444,"d":"49007"},{"$f":"IFERROR(IF(Standard,K19/CalsPerPound,K19/CalsPerPound/2.2),\"\")","v":{"v":14.001923252704126,"d":"14.0"}},{"$f":"IFERROR(WeightToLoseGain-L19,\"\")","v":{"v":0.9980767472958743,"d":"1.00"}},{"$f":"IFERROR(IF(C18<>\"\",M19/(WeightToLoseGain),\"\"),\"\")","v":{"v":0.06653844981972495,"d":"7%"}}]
[null,null,"2013-02-28","",9,{"v":148.859066109847,"d":"148.9"},{"$f":"IFERROR(RunningBMR,\"\")","v":{"v":1448.2369375778344,"d":"1448"}},{"$f":"IFERROR(IF(L19>0,G19*ActivityFactor+IF(WeightGoal=\"Maintain\",0,IF(WeightGoal=\"Decrease\",-500,IF(WeightGoal=\"Increase\",500))),\"\"),\"\")","v":{"v":1745.7286155355746,"d":"1746"}},{"$f":"IFERROR(G20*(ActivityFactor),\"\")","v":{"v":2244.7672532456436,"d":"2245"}},{"$f":"IFERROR(IF(WeightGoal=\"Increase\",H20-I20,I20-H20),\"\")","v":{"v":499.038637710069,"d":"499"}},{"v":48507.69274675437,"d":"48508"},{"$f":"IFERROR(IF(Standard,K20/CalsPerPound,K20/CalsPerPound/2.2),\"\")","v":{"v":13.859340784786964,"d":"13.9"}},{"$f":"IFERROR(WeightToLoseGain-L20,\"\")","v":{"v":1.1406592152130361,"d":"1.14"}},{"$f":"IFERROR(IF(C19<>\"\",M20/(WeightToLoseGain),\"\"),\"\")","v":{"v":0.07604394768086907,"d":"8%"}}]
[null,null,"2013-03-01","",10,{"v":148.71648364192984,"d":"148.7"},{"$f":"IFERROR(RunningBMR,\"\")","v":{"v":1447.6167038423948,"d":"1448"}},{"$f":"IFERROR(IF(L20>0,G20*ActivityFactor+IF(WeightGoal=\"Maintain\",0,IF(WeightGoal=\"Decrease\",-500,IF(WeightGoal=\"Increase\",500))),\"\"),\"\")","v":{"v":1744.7672532456436,"d":"1745"}},{"$f":"IFERROR(G21*(ActivityFactor),\"\")","v":{"v":2243.805890955712,"d":"2244"}},{"$f":"IFERROR(IF(WeightGoal=\"Increase\",H21-I21,I21-H21),\"\")","v":{"v":499.03863771006854,"d":"499"}},{"v":48008.654109044306,"d":"48009"},{"$f":"IFERROR(IF(Standard,K21/CalsPerPound,K21/CalsPerPound/2.2),\"\")","v":{"v":13.716758316869802,"d":"13.7"}},{"$f":"IFERROR(WeightToLoseGain-L21,\"\")","v":{"v":1.283241683130198,"d":"1.28"}},{"$f":"IFERROR(IF(C20<>\"\",M21/(WeightToLoseGain),\"\"),\"\")","v":{"v":0.0855494455420132,"d":"9%"}}]
[null,null,"2013-03-02","",11,{"v":148.5739011740127,"d":"148.6"},{"$f":"IFERROR(RunningBMR,\"\")","v":{"v":1446.996470106955,"d":"1447"}},{"$f":"IFERROR(IF(L21>0,G21*ActivityFactor+IF(WeightGoal=\"Maintain\",0,IF(WeightGoal=\"Decrease\",-500,IF(WeightGoal=\"Increase\",500))),\"\"),\"\")","v":{"v":1743.8058909557121,"d":"1744"}},{"$f":"IFERROR(G22*(ActivityFactor),\"\")","v":{"v":2242.84452866578,"d":"2243"}},{"$f":"IFERROR(IF(WeightGoal=\"Increase\",H22-I22,I22-H22),\"\")","v":{"v":499.0386377100681,"d":"499"}},{"v":47509.61547133424,"d":"47510"},{"$f":"IFERROR(IF(Standard,K22/CalsPerPound,K22/CalsPerPound/2.2),\"\")","v":{"v":13.57417584895264,"d":"13.6"}},{"$f":"IFERROR(WeightToLoseGain-L22,\"\")","v":{"v":1.42582415104736,"d":"1.43"}},{"$f":"IFERROR(IF(C21<>\"\",M22/(WeightToLoseGain),\"\"),\"\")","v":{"v":0.09505494340315733,"d":"10%"}}]
[null,null,"2013-03-03","",12,{"v":148.43131870609554,"d":"148.4"},{"$f":"IFERROR(RunningBMR,\"\")","v":{"v":1446.3762363715157,"d":"1446"}},{"$f":"IFERROR(IF(L22>0,G22*ActivityFactor+IF(WeightGoal=\"Maintain\",0,IF(WeightGoal=\"Decrease\",-500,IF(WeightGoal=\"Increase\",500))),\"\"),\"\")","v":{"v":1742.8445286657802,"d":"1743"}},{"$f":"IFERROR(G23*(ActivityFactor),\"\")","v":{"v":2241.883166375849,"d":"2242"}},{"$f":"IFERROR(IF(WeightGoal=\"Increase\",H23-I23,I23-H23),\"\")","v":{"v":499.038637710069,"d":"499"}},{"v":47010.576833624174,"d":"47011"},{"$f":"IFERROR(IF(Standard,K23/CalsPerPound,K23/CalsPerPound/2.2),\"\")","v":{"v":13.431593381035478,"d":"13.4"}},{"$f":"IFERROR(WeightToLoseGain-L23,\"\")","v":{"v":1.5684066189645218,"d":"1.57"}},{"$f":"IFERROR(IF(C22<>\"\",M23/(WeightToLoseGain),\"\"),\"\")","v":{"v":0.10456044126430146,"d":"10%"}}]
[null,null,"2013-03-04","",13,{"v":148.2887362381784,"d":"148.3"},{"$f":"IFERROR(RunningBMR,\"\")","v":{"v":1445.756002636076,"d":"1446"}},{"$f":"IFERROR(IF(L23>0,G23*ActivityFactor+IF(WeightGoal=\"Maintain\",0,IF(WeightGoal=\"Decrease\",-500,IF(WeightGoal=\"Increase\",500))),\"\"),\"\")","v":{"v":1741.8831663758492,"d":"1742"}},{"$f":"IFERROR(G24*(ActivityFactor),\"\")","v":{"v":2240.9218040859178,"d":"2241"}},{"$f":"IFERROR(IF(WeightGoal=\"Increase\",H24-I24,I24-H24),\"\")","v":{"v":499.03863771006854,"d":"499"}},{"v":46511.53819591411,"d":"46512"},{"$f":"IFERROR(IF(Standard,K24/CalsPerPound,K24/CalsPerPound/2.2),\"\")","v":{"v":13.289010913118316,"d":"13.3"}},{"$f":"IFERROR(WeightToLoseGain-L24,\"\")","v":{"v":1.7109890868816837,"d":"1.71"}},{"$f":"IFERROR(IF(C23<>\"\",M24/(WeightToLoseGain),\"\"),\"\")","v":{"v":0.11406593912544558,"d":"11%"}}]
[null,null,"2013-03-05","",14,{"v":148.14615377026124,"d":"148.1"},{"$f":"IFERROR(RunningBMR,\"\")","v":{"v":1445.1357689006363,"d":"1445"}},{"$f":"IFERROR(IF(L24>0,G24*ActivityFactor+IF(WeightGoal=\"Maintain\",0,IF(WeightGoal=\"Decrease\",-500,IF(WeightGoal=\"Increase\",500))),\"\"),\"\")","v":{"v":1740.9218040859178,"d":"1741"}},{"$f":"IFERROR(G25*(ActivityFactor),\"\")","v":{"v":2239.9604417959863,"d":"2240"}},{"$f":"IFERROR(IF(WeightGoal=\"Increase\",H25-I25,I25-H25),\"\")","v":{"v":499.03863771006854,"d":"499"}},{"v":46012.49955820404,"d":"46012"},{"$f":"IFERROR(IF(Standard,K25/CalsPerPound,K25/CalsPerPound/2.2),\"\")","v":{"v":13.146428445201154,"d":"13.1"}},{"$f":"IFERROR(WeightToLoseGain-L25,\"\")","v":{"v":1.8535715547988456,"d":"1.85"}},{"$f":"IFERROR(IF(C24<>\"\",M25/(WeightToLoseGain),\"\"),\"\")","v":{"v":0.1235714369865897,"d":"12%"}}]
[null,null,"2013-03-06",3,15,{"v":148.00357130234408,"d":"148.0"},{"$f":"IFERROR(RunningBMR,\"\")","v":{"v":1444.5155351651968,"d":"1445"}},{"$f":"IFERROR(IF(L25>0,G25*ActivityFactor+IF(WeightGoal=\"Maintain\",0,IF(WeightGoal=\"Decrease\",-500,IF(WeightGoal=\"Increase\",500))),\"\"),\"\")","v":{"v":1739.9604417959863,"d":"1740"}},{"$f":"IFERROR(G26*(ActivityFactor),\"\")","v":{"v":2238.999079506055,"d":"2239"}},{"$f":"IFERROR(IF(WeightGoal=\"Increase\",H26-I26,I26-H26),\"\")","v":{"v":499.03863771006854,"d":"499"}},{"v":45513.46092049398,"d":"45513"},{"$f":"IFERROR(IF(Standard,K26/CalsPerPound,K26/CalsPerPound/2.2),\"\")","v":{"v":13.003845977283994,"d":"13.0"}},{"$f":"IFERROR(WeightToLoseGain-L26,\"\")","v":{"v":1.9961540227160057,"d":"2.00"}},{"$f":"IFERROR(IF(C25<>\"\",M26/(WeightToLoseGain),\"\"),\"\")","v":{"v":0.13307693484773372,"d":"13%"}}]
[null,null,"2013-03-07","",16,{"v":147.86098883442693,"d":"147.9"},{"$f":"IFERROR(RunningBMR,\"\")","v":{"v":1443.8953014297572,"d":"1444"}},{"$f":"IFERROR(IF(L26>0,G26*ActivityFactor+IF(WeightGoal=\"Maintain\",0,IF(WeightGoal=\"Decrease\",-500,IF(WeightGoal=\"Increase\",500))),\"\"),\"\")","v":{"v":1738.9990795060548,"d":"1739"}},{"$f":"IFERROR(G27*(ActivityFactor),\"\")","v":{"v":2238.037717216124,"d":"2238"}},{"$f":"IFERROR(IF(WeightGoal=\"Increase\",H27-I27,I27-H27),\"\")","v":{"v":499.038637710069,"d":"499"}},{"v":45014.42228278391,"d":"45014"},{"$f":"IFERROR(IF(Standard,K27/CalsPerPound,K27/CalsPerPound/2.2),\"\")","v":{"v":12.861263509366832,"d":"12.9"}},{"$f":"IFERROR(WeightToLoseGain-L27,\"\")","v":{"v":2.1387364906331676,"d":"2.14"}},{"$f":"IFERROR(IF(C26<>\"\",M27/(WeightToLoseGain),\"\"),\"\")","v":{"v":0.14258243270887785,"d":"14%"}}]
[null,null,"2013-03-08","",17,{"v":147.71840636650978,"d":"147.7"},{"$f":"IFERROR(RunningBMR,\"\")","v":{"v":1443.2750676943176,"d":"1443"}},{"$f":"IFERROR(IF(L27>0,G27*ActivityFactor+IF(WeightGoal=\"Maintain\",0,IF(WeightGoal=\"Decrease\",-500,IF(WeightGoal=\"Increase\",500))),\"\"),\"\")","v":{"v":1738.0377172161238,"d":"1738"}},{"$f":"IFERROR(G28*(ActivityFactor),\"\")","v":{"v":2237.0763549261924,"d":"2237"}},{"$f":"IFERROR(IF(WeightGoal=\"Increase\",H28-I28,I28-H28),\"\")","v":{"v":499.03863771006854,"d":"499"}},{"v":44515.383645073845,"d":"44515"},{"$f":"IFERROR(IF(Standard,K28/CalsPerPound,K28/CalsPerPound/2.2),\"\")","v":{"v":12.71868104144967,"d":"12.7"}},{"$f":"IFERROR(WeightToLoseGain-L28,\"\")","v":{"v":2.2813189585503295,"d":"2.28"}},{"$f":"IFERROR(IF(C27<>\"\",M28/(WeightToLoseGain),\"\"),\"\")","v":{"v":0.15208793057002196,"d":"15%"}}]
[null,null,"2013-03-09","",18,{"v":147.57582389859263,"d":"147.6"},{"$f":"IFERROR(RunningBMR,\"\")","v":{"v":1442.6548339588778,"d":"1443"}},{"$f":"IFERROR(IF(L28>0,G28*ActivityFactor+IF(WeightGoal=\"Maintain\",0,IF(WeightGoal=\"Decrease\",-500,IF(WeightGoal=\"Increase\",500))),\"\"),\"\")","v":{"v":1737.0763549261924,"d":"1737"}},{"$f":"IFERROR(G29*(ActivityFactor),\"\")","v":{"v":2236.1149926362605,"d":"2236"}},{"$f":"IFERROR(IF(WeightGoal=\"Increase\",H29-I29,I29-H29),\"\")","v":{"v":499.0386377100681,"d":"499"}},{"v":44016.34500736378,"d":"44016"},{"$f":"IFERROR(IF(Standard,K29/CalsPerPound,K29/CalsPerPound/2.2),\"\")","v":{"v":12.576098573532509,"d":"12.6"}},{"$f":"IFERROR(WeightToLoseGain-L29,\"\")","v":{"v":2.4239014264674914,"d":"2.42"}},{"$f":"IFERROR(IF(C28<>\"\",M29/(WeightToLoseGain),\"\"),\"\")","v":{"v":0.1615934284311661,"d":"16%"}}]
[null,null,"2013-03-10","",19,{"v":147.43324143067548,"d":"147.4"},{"$f":"IFERROR(RunningBMR,\"\")","v":{"v":1442.0346002234385,"d":"1442"}},{"$f":"IFERROR(IF(L29>0,G29*ActivityFactor+IF(WeightGoal=\"Maintain\",0,IF(WeightGoal=\"Decrease\",-500,IF(WeightGoal=\"Increase\",500))),\"\"),\"\")","v":{"v":1736.1149926362605,"d":"1736"}},{"$f":"IFERROR(G30*(ActivityFactor),\"\")","v":{"v":2235.15363034633,"d":"2235"}},{"$f":"IFERROR(IF(WeightGoal=\"Increase\",H30-I30,I30-H30),\"\")","v":{"v":499.03863771006945,"d":"499"}},{"v":43517.306369653714,"d":"43517"},{"$f":"IFERROR(IF(Standard,K30/CalsPerPound,K30/CalsPerPound/2.2),\"\")","v":{"v":12.433516105615347,"d":"12.4"}},{"$f":"IFERROR(WeightToLoseGain-L30,\"\")","v":{"v":2.5664838943846533,"d":"2.57"}},{"$f":"IFERROR(IF(C29<>\"\",M30/(WeightToLoseGain),\"\"),\"\")","v":{"v":0.17109892629231022,"d":"17%"}}]
{"$rows_left_out":970}
{"sheet":"Exercise Type Lookup","index":1,"n_rows":8,"n_cols":4,"rows_kept":8,"hidden":true}
[null,"Exercise Type Lookup"]
[null," This sheet should remain hidden."]
[null,"EXERCISE TYPE","DESCRIPTION","FACTOR"]
[null,"SEDENTARY ","LITTLE TO NO EXERCISE",1.2]
[null,"LIGHT ACTIVITY ","EXERCISE 1-2 DAYS/WEEK",1.375]
[null,"MODERATE ACTIVITY ","EXERCISE 3-5 DAYS/WEEK",1.55]
[null,"VERY ACTIVE ","EXERCISE 6-7 DAYS/WEEK",1.725]
[null,"EXTRA ACTIVE ","EXERCISE 6-7 DAYS/WEEK + PHYSICAL JOB/2X TRAINING",1.9]