{"text_format":"3","workbook":"xlsx","n_sheets":3,"sheets":["Grade Sheet","Readme","PSW_Sheet"],"not_rendered":{"defined_names":75},"cells_cut":10,"read":"whole","date_system":"1900"}

{"sheet":"Grade Sheet","index":0,"n_rows":32,"n_cols":34,"rows_kept":32,"merged":[[1,1,1,5],[2,1,2,5],[4,1,4,5],[4,6,4,12],[4,13,4,15],[4,16,4,19],[4,20,4,30],[4,31,4,34],[5,2,5,5],[5,31,5,32],[5,33,5,34],[6,2,6,5],[6,31,6,32],[6,33,6,34],[7,2,7,5],[7,31,7,32],[7,33,7,34],[8,2,8,5],[8,31,8,32],[8,33,8,34],[9,2,9,5],[9,31,9,32],[9,33,9,34],[10,2,10,5],[10,31,10,32],[10,33,10,34],[11,2,11,5],[11,31,11,32],[11,33,11,34],[12,2,12,5],[12,31,12,32],[12,33,12,34],[13,2,13,5],[13,31,13,32],[13,33,13,34],[14,2,14,5],[14,31,14,32],[14,33,14,34],[15,2,15,5],[15,31,15,32],[15,33,15,34],[16,2,16,5],[16,31,16,32],[16,33,16,34],[17,2,17,5],[17,31,17,32],[17,33,17,34],[18,2,18,5],[18,31,18,32],[18,33,18,34],[19,2,19,5],[19,31,19,32],[19,33,19,34],[20,2,20,5],[20,31,20,32],[20,33,20,34],[21,2,21,5],[21,31,21,32],[21,33,21,34],[22,2,22,5],[22,31,22,32],[22,33,22,34],[23,2,23,5],[23,31,23,32],[23,33,23,34],[24,2,24,5],[24,31,24,32],[24,33,24,34],[25,2,25,5],[25,31,25,32],[25,33,25,34],[26,2,26,5],[26,31,26,32],[26,33,26,34],[27,2,27,5],[27,31,27,32],[27,33,27,34],[28,2,28,5],[28,31,28,32],[28,33,28,34],[29,2,29,5],[29,31,29,32],[29,33,29,34],[30,2,30,5],[30,31,30,32],[30,33,30,34],[31,1,31,5],[31,31,31,32],[31,33,31,34],[32,31,32,32],[33,31,33,32]]}
[]
[null,{"$f":"IF(Class_Name=\"\",\"\",Class_Name)","v":"Class Name"}]
[null,{"$f":"IF(Course_Name=\"\",\"\",Course_Name)","v":"Physics 1"}]
[]
[null,"Student",{"$nulls":4},"Midterms",{"$nulls":6},"Finals",null,null,"Projects",{"$nulls":3},"Homeworks",{"$nulls":10},"End of the Course"]
[null,"ID","Name",{"$nulls":3},1,2,3,4,5,6,"Avg",1,2,"Avg",1,2,3,"Avg",1,2,3,4,5,6,7,8,9,10,"Avg","Avg",null,"Grade"]
[null,{"$f":"IF(Readme!V5=0,\"\",Readme!O5)","v":1024},{"$f":"IF(Readme!V5=0,\"\",Readme!P5)","v":"J.Brown"},{"$nulls":3},65,70,66,{"$nulls":3},{"$f":"IF(SUM(G7:L7)=0,0,AVERAGE(G7:L7))","v":{"v":67,"d":"67.00"}},55,null,{"$f":"IF(SUM(N7:O7)=0,0,AVERAGE(N7:O7))","v":{"v":55,"d":"55.00"}},70,null,null,{"$f":"IF(SUM(Q7:S7)=0,0,AVERAGE(Q7:S7))","v":{"v":70,"d":"70.00"}},50,63,55,70,84,{"$nulls":5},{"$f":"IF(SUM(U7:AD7)=0,0,AVERAGE(U7:AD7))","v":{"v":64.4,"d":"64.40"}},{"$f":"Rate_MT*M7+Rate_Final*P7+Rate_Pr*T7+Rate_HW*AE7","v":{"v":62.53999999999999,"d":"62.54"}},null,{"$f":"IF(Readme!V5=0,\"\",VLOOKUP(AF7,Grade_List,2,TRUE))","v":"D-"}]
[null,{"$f":"IF(Readme!V6=0,\"\",Readme!O6)","v":1025},{"$f":"IF(Readme!V6=0,\"\",Readme!P6)","v":"A.Green"},{"$nulls":3},85,97,90,{"$nulls":3},{"$f":"IF(SUM(G8:L8)=0,0,AVERAGE(G8:L8))","v":{"v":90.66666666666667,"d":"90.67"}},89,null,{"$f":"IF(SUM(N8:O8)=0,0,AVERAGE(N8:O8))","v":{"v":89,"d":"89.00"}},80,null,null,{"$f":"IF(SUM(Q8:S8)=0,0,AVERAGE(Q8:S8))","v":{"v":80,"d":"80.00"}},100,97,100,85,90,{"$nulls":5},{"$f":"IF(SUM(U8:AD8)=0,0,AVERAGE(U8:AD8))","v":{"v":94.4,"d":"94.40"}},88.24,null,{"$f":"IF(Readme!V6=0,\"\",VLOOKUP(AF8,Grade_List,2,TRUE))","v":"B+"}]
[null,{"$f":"IF(Readme!V7=0,\"\",Readme!O7)","v":1064},{"$f":"IF(Readme!V7=0,\"\",Readme!P7)","v":"M.White"},{"$nulls":3},75,95,70,{"$nulls":3},{"v":80,"d":"80.00"},76,null,{"v":76,"d":"76.00"},85,null,null,{"v":85,"d":"85.00"},80,75,89,85,84,{"$nulls":5},{"v":82.6,"d":"82.60"},{"v":79.66000000000001,"d":"79.66"},null,{"$f":"IF(Readme!V7=0,\"\",VLOOKUP(AF9,Grade_List,2,TRUE))","v":"C+"}]
[null,{"$f":"IF(Readme!V8=0,\"\",Readme!O8)","v":""},{"$f":"IF(Readme!V8=0,\"\",Readme!P8)","v":""},{"$nulls":9},{"v":0,"d":"0.00"},null,null,{"v":0,"d":"0.00"},{"$nulls":3},{"v":0,"d":"0.00"},{"$nulls":10},{"v":0,"d":"0.00"},{"v":0,"d":"0.00"},null,{"$f":"IF(Readme!V8=0,\"\",VLOOKUP(AF10,Grade_List,2,TRUE))","v":""}]
[null,{"$f":"IF(Readme!V9=0,\"\",Readme!O9)","v":""},{"$f":"IF(Readme!V9=0,\"\",Readme!P9)","v":""},{"$nulls":9},{"v":0,"d":"0.00"},null,null,{"v":0,"d":"0.00"},{"$nulls":3},{"v":0,"d":"0.00"},{"$nulls":10},{"v":0,"d":"0.00"},{"v":0,"d":"0.00"},null,{"$f":"IF(Readme!V9=0,\"\",VLOOKUP(AF11,Grade_List,2,TRUE))","v":""}]
[null,{"$f":"IF(Readme!V10=0,\"\",Readme!O10)","v":""},{"$f":"IF(Readme!V10=0,\"\",Readme!P10)","v":""},{"$nulls":9},{"v":0,"d":"0.00"},null,null,{"v":0,"d":"0.00"},{"$nulls":3},{"v":0,"d":"0.00"},{"$nulls":10},{"v":0,"d":"0.00"},{"v":0,"d":"0.00"},null,{"$f":"IF(Readme!V10=0,\"\",VLOOKUP(AF12,Grade_List,2,TRUE))","v":""}]
[null,{"$f":"IF(Readme!V11=0,\"\",Readme!O11)","v":""},{"$f":"IF(Readme!V11=0,\"\",Readme!P11)","v":""},{"$nulls":9},{"v":0,"d":"0.00"},null,null,{"v":0,"d":"0.00"},{"$nulls":3},{"v":0,"d":"0.00"},{"$nulls":10},{"v":0,"d":"0.00"},{"v":0,"d":"0.00"},null,{"$f":"IF(Readme!V11=0,\"\",VLOOKUP(AF13,Grade_List,2,TRUE))","v":""}]
[null,{"$f":"IF(Readme!V12=0,\"\",Readme!O12)","v":""},{"$f":"IF(Readme!V12=0,\"\",Readme!P12)","v":""},{"$nulls":9},{"v":0,"d":"0.00"},null,null,{"v":0,"d":"0.00"},{"$nulls":3},{"v":0,"d":"0.00"},{"$nulls":10},{"v":0,"d":"0.00"},{"v":0,"d":"0.00"},null,{"$f":"IF(Readme!V12=0,\"\",VLOOKUP(AF14,Grade_List,2,TRUE))","v":""}]
[null,{"$f":"IF(Readme!V13=0,\"\",Readme!O13)","v":""},{"$f":"IF(Readme!V13=0,\"\",Readme!P13)","v":""},{"$nulls":9},{"v":0,"d":"0.00"},null,null,{"v":0,"d":"0.00"},{"$nulls":3},{"v":0,"d":"0.00"},{"$nulls":10},{"v":0,"d":"0.00"},{"v":0,"d":"0.00"},null,{"$f":"IF(Readme!V13=0,\"\",VLOOKUP(AF15,Grade_List,2,TRUE))","v":""}]
[null,{"$f":"IF(Readme!V14=0,\"\",Readme!O14)","v":""},{"$f":"IF(Readme!V14=0,\"\",Readme!P14)","v":""},{"$nulls":9},{"v":0,"d":"0.00"},null,null,{"v":0,"d":"0.00"},{"$nulls":3},{"v":0,"d":"0.00"},{"$nulls":10},{"v":0,"d":"0.00"},{"v":0,"d":"0.00"},null,{"$f":"IF(Readme!V14=0,\"\",VLOOKUP(AF16,Grade_List,2,TRUE))","v":""}]
[null,{"$f":"IF(Readme!V15=0,\"\",Readme!O15)","v":""},{"$f":"IF(Readme!V15=0,\"\",Readme!P15)","v":""},{"$nulls":9},{"v":0,"d":"0.00"},null,null,{"v":0,"d":"0.00"},{"$nulls":3},{"v":0,"d":"0.00"},{"$nulls":10},{"v":0,"d":"0.00"},{"v":0,"d":"0.00"},null,{"$f":"IF(Readme!V15=0,\"\",VLOOKUP(AF17,Grade_List,2,TRUE))","v":""}]
[null,{"$f":"IF(Readme!V16=0,\"\",Readme!O16)","v":""},{"$f":"IF(Readme!V16=0,\"\",Readme!P16)","v":""},{"$nulls":9},{"v":0,"d":"0.00"},null,null,{"v":0,"d":"0.00"},{"$nulls":3},{"v":0,"d":"0.00"},{"$nulls":10},{"v":0,"d":"0.00"},{"v":0,"d":"0.00"},null,{"$f":"IF(Readme!V16=0,\"\",VLOOKUP(AF18,Grade_List,2,TRUE))","v":""}]
[null,{"$f":"IF(Readme!V17=0,\"\",Readme!O17)","v":""},{"$f":"IF(Readme!V17=0,\"\",Readme!P17)","v":""},{"$nulls":9},{"v":0,"d":"0.00"},null,null,{"v":0,"d":"0.00"},{"$nulls":3},{"v":0,"d":"0.00"},{"$nulls":10},{"v":0,"d":"0.00"},{"v":0,"d":"0.00"},null,{"$f":"IF(Readme!V17=0,\"\",VLOOKUP(AF19,Grade_List,2,TRUE))","v":""}]
[null,{"$f":"IF(Readme!V18=0,\"\",Readme!O18)","v":""},{"$f":"IF(Readme!V18=0,\"\",Readme!P18)","v":""},{"$nulls":9},{"v":0,"d":"0.00"},null,null,{"v":0,"d":"0.00"},{"$nulls":3},{"v":0,"d":"0.00"},{"$nulls":10},{"v":0,"d":"0.00"},{"v":0,"d":"0.00"},null,{"$f":"IF(Readme!V18=0,\"\",VLOOKUP(AF20,Grade_List,2,TRUE))","v":""}]
[null,{"$f":"IF(Readme!V19=0,\"\",Readme!O19)","v":""},{"$f":"IF(Readme!V19=0,\"\",Readme!P19)","v":""},{"$nulls":9},{"v":0,"d":"0.00"},null,null,{"v":0,"d":"0.00"},{"$nulls":3},{"v":0,"d":"0.00"},{"$nulls":10},{"v":0,"d":"0.00"},{"v":0,"d":"0.00"},null,{"$f":"IF(Readme!V19=0,\"\",VLOOKUP(AF21,Grade_List,2,TRUE))","v":""}]
[null,{"$f":"IF(Readme!V20=0,\"\",Readme!O20)","v":""},{"$f":"IF(Readme!V20=0,\"\",Readme!P20)","v":""},{"$nulls":9},{"v":0,"d":"0.00"},null,null,{"v":0,"d":"0.00"},{"$nulls":3},{"v":0,"d":"0.00"},{"$nulls":10},{"v":0,"d":"0.00"},{"v":0,"d":"0.00"},null,{"$f":"IF(Readme!V20=0,\"\",VLOOKUP(AF22,Grade_List,2,TRUE))","v":""}]
[null,{"$f":"IF(Readme!V21=0,\"\",Readme!O21)","v":""},{"$f":"IF(Readme!V21=0,\"\",Readme!P21)","v":""},{"$nulls":9},{"v":0,"d":"0.00"},null,null,{"v":0,"d":"0.00"},{"$nulls":3},{"v":0,"d":"0.00"},{"$nulls":10},{"v":0,"d":"0.00"},{"v":0,"d":"0.00"},null,{"$f":"IF(Readme!V21=0,\"\",VLOOKUP(AF23,Grade_List,2,TRUE))","v":""}]
[null,{"$f":"IF(Readme!V22=0,\"\",Readme!O22)","v":""},{"$f":"IF(Readme!V22=0,\"\",Readme!P22)","v":""},{"$nulls":9},{"v":0,"d":"0.00"},null,null,{"v":0,"d":"0.00"},{"$nulls":3},{"v":0,"d":"0.00"},{"$nulls":10},{"v":0,"d":"0.00"},{"v":0,"d":"0.00"},null,{"$f":"IF(Readme!V22=0,\"\",VLOOKUP(AF24,Grade_List,2,TRUE))","v":""}]
[null,{"$f":"IF(Readme!V23=0,\"\",Readme!O23)","v":""},{"$f":"IF(Readme!V23=0,\"\",Readme!P23)","v":""},{"$nulls":9},{"v":0,"d":"0.00"},null,null,{"v":0,"d":"0.00"},{"$nulls":3},{"v":0,"d":"0.00"},{"$nulls":10},{"v":0,"d":"0.00"},{"v":0,"d":"0.00"},null,{"$f":"IF(Readme!V23=0,\"\",VLOOKUP(AF25,Grade_List,2,TRUE))","v":""}]
[null,{"$f":"IF(Readme!V24=0,\"\",Readme!O24)","v":""},{"$f":"IF(Readme!V24=0,\"\",Readme!P24)","v":""},{"$nulls":9},{"v":0,"d":"0.00"},null,null,{"v":0,"d":"0.00"},{"$nulls":3},{"v":0,"d":"0.00"},{"$nulls":10},{"v":0,"d":"0.00"},{"v":0,"d":"0.00"},null,{"$f":"IF(Readme!V24=0,\"\",VLOOKUP(AF26,Grade_List,2,TRUE))","v":""}]
[null,{"$f":"IF(Readme!V25=0,\"\",Readme!O25)","v":""},{"$f":"IF(Readme!V25=0,\"\",Readme!P25)","v":""},{"$nulls":9},{"v":0,"d":"0.00"},null,null,{"v":0,"d":"0.00"},{"$nulls":3},{"v":0,"d":"0.00"},{"$nulls":10},{"v":0,"d":"0.00"},{"v":0,"d":"0.00"},null,{"$f":"IF(Readme!V25=0,\"\",VLOOKUP(AF27,Grade_List,2,TRUE))","v":""}]
[null,{"$f":"IF(Readme!V26=0,\"\",Readme!O26)","v":""},{"$f":"IF(Readme!V26=0,\"\",Readme!P26)","v":""},{"$nulls":9},{"v":0,"d":"0.00"},null,null,{"v":0,"d":"0.00"},{"$nulls":3},{"v":0,"d":"0.00"},{"$nulls":10},{"v":0,"d":"0.00"},{"v":0,"d":"0.00"},null,{"$f":"IF(Readme!V26=0,\"\",VLOOKUP(AF28,Grade_List,2,TRUE))","v":""}]
[null,{"$f":"IF(Readme!V27=0,\"\",Readme!O27)","v":""},{"$f":"IF(Readme!V27=0,\"\",Readme!P27)","v":""},{"$nulls":9},{"v":0,"d":"0.00"},null,null,{"v":0,"d":"0.00"},{"$nulls":3},{"v":0,"d":"0.00"},{"$nulls":10},{"v":0,"d":"0.00"},{"v":0,"d":"0.00"},null,{"$f":"IF(Readme!V27=0,\"\",VLOOKUP(AF29,Grade_List,2,TRUE))","v":""}]
[null,{"$f":"IF(Readme!V28=0,\"\",Readme!O28)","v":""},{"$f":"IF(Readme!V28=0,\"\",Readme!P28)","v":""},{"$nulls":9},{"v":0,"d":"0.00"},null,null,{"v":0,"d":"0.00"},{"$nulls":3},{"v":0,"d":"0.00"},{"$nulls":10},{"v":0,"d":"0.00"},{"v":0,"d":"0.00"},null,{"$f":"IF(Readme!V28=0,\"\",VLOOKUP(AF30,Grade_List,2,TRUE))","v":""}]
[null,{"$f":"IF(Readme!V29=0,\"\",Readme!O29)","v":""},{"$f":"IF(Readme!V29=0,\"\",Readme!P29)","v":""},{"$nulls":9},{"v":0,"d":"0.00"},null,null,{"v":0,"d":"0.00"},{"$nulls":3},{"v":0,"d":"0.00"},{"$nulls":10},{"v":0,"d":"0.00"},{"v":0,"d":"0.00"},null,{"$f":"IF(Readme!V29=0,\"\",VLOOKUP(AF31,Grade_List,2,TRUE))","v":""}]
[null,"Class Averages:",{"$nulls":4},{"$f":"IF(NbOfStudents=0,0,SUM(G7:G31)/NbOfStudents)","v":{"v":75,"d":"75.00"}},{"v":87.33333333333333,"d":"87.33"},{"v":75.33333333333333,"d":"75.33"},{"v":0,"d":"0.00"},{"v":0,"d":"0.00"},{"v":0,"d":"0.00"},{"v":79.22222222222223,"d":"79.22"},{"v":73.33333333333333,"d":"73.33"},{"v":0,"d":"0.00"},{"v":73.33333333333333,"d":"73.33"},{"v":78.33333333333333,"d":"78.33"},{"v":0,"d":"0.00"},{"v":0,"d":"0.00"},{"v":78.33333333333333,"d":"78.33"},{"v":76.66666666666667,"d":"76.67"},{"v":78.33333333333333,"d":"78.33"},{"v":81.33333333333333,"d":"81.33"},{"v":80,"d":"80.00"},{"v":86,"d":"86.00"},{"v":0,"d":"0.00"},{"v":0,"d":"0.00"},{"v":0,"d":"0.00"},{"v":0,"d":"0.00"},{"v":0,"d":"0.00"},{"v":80.46666666666667,"d":"80.47"},{"$f":"IF(NbOfStudents=0,0,SUM(AF7:AG31)/NbOfStudents)","v":{"v":76.81333333333333,"d":"76.81"}},null,{"$f":"IF(NbOfStudents=0,\"\",VLOOKUP(AF32,Grade_List,2,TRUE))","v":"C"}]

{"sheet":"Readme","index":1,"n_rows":48,"n_cols":22,"rows_kept":48,"merged":[[3,15,3,19],[4,3,4,6],[4,15,4,19],[5,15,5,19],[6,3,6,6],[6,15,6,19],[7,15,7,19],[8,15,8,19],[9,15,9,19],[10,15,10,19],[11,15,11,19],[12,15,12,19],[13,15,13,19],[14,15,14,19],[15,15,15,19],[16,15,16,19],[17,15,17,19],[18,15,18,19],[19,15,19,19],[20,15,20,19],[21,15,21,19],[22,15,22,19],[23,15,23,19],[24,15,24,19],[25,15,25,19],[26,15,26,19],[27,15,27,19],[28,5,28,6],[28,15,28,19],[29,5,29,6],[30,5,30,6],[31,5,31,6],[32,5,32,6]]}
[]
[]
[{"$nulls":3},"Follow the steps to enable your online Grade Sheet."]
[null,null,"1)","Type the class name:",{"$nulls":10},"ID","Name"]
[{"$nulls":3},"Class Name",{"$nulls":10},1024,"J.Brown",{"$nulls":5},{"$f":"IF(OR(O5=\"\",P5=\"\"),0,1)","v":1}]
[null,null,"2)","Type the name of the course:",{"$nulls":10},1025,"A.Green",{"$nulls":5},{"$f":"IF(OR(O6=\"\",P6=\"\"),0,1)","v":1}]
[{"$nulls":3},"Physics 1",{"$nulls":10},1064,"M.White",{"$nulls":5},1]
[null,null,"2)","Fill the student ID & Name list on the right.",{"$nulls":17},0]
[null,null,"3)","Fill the grade list below, you can leave the unused ones blank:",{"$nulls":17},0]
[{"$nulls":3},"Grade","Letter",{"$nulls":16},0]
[{"$nulls":3},0,"F",{"$nulls":16},0]
[{"$nulls":3},45,"F",{"$nulls":16},0]
[{"$nulls":3},52,"E-",{"$nulls":16},0]
[{"$nulls":3},55,"E",{"$nulls":16},0]
[{"$nulls":3},58,"E+",{"$nulls":16},0]
[{"$nulls":3},62,"D-",{"$nulls":16},0]
[{"$nulls":3},65,"D",{"$nulls":16},0]
[{"$nulls":3},68,"D+",{"$nulls":16},0]
[{"$nulls":3},72,"C- ",{"$nulls":16},0]
[{"$nulls":3},75,"C",{"$nulls":16},0]
[{"$nulls":3},78,"C+",{"$nulls":16},0]
[{"$nulls":3},82,"B-",{"$nulls":16},0]
[{"$nulls":3},85,"B",{"$nulls":16},0]
[{"$nulls":3},88,"B+",{"$nulls":16},0]
[{"$nulls":3},92,"A-",{"$nulls":16},0]
[{"$nulls":3},95,"A",{"$nulls":16},0]
[{"$nulls":3},98,"A+",{"$nulls":16},0]
[null,null,"4)","Specify the weights (total should be %100):",{"$nulls":17},0]
[{"$nulls":3},"Midterms:",null,{"v":0.3,"d":"30%"},{"$nulls":15},0]
[{"$nulls":3},"Finals:",null,{"v":0.4,"d":"40%"},{"$nulls":15},{"$f":"SUM(V5:V29)","v":3}]
[{"$nulls":3},"Projects:",null,{"v":0.2,"d":"20%"}]
[{"$nulls":3},"Homeworks:",null,{"v":0.1,"d":"10%"}]
[{"$nulls":3},"Total",null,{"$f":"SUM(F29:G32)","v":{"v":0.9999999999999999,"d":"100%"}}]
[null,null,"5)","Your Grade Sheet is ready to use. Further steps are for online use. First visit the site below:"]
[{"$nulls":3},"http://www.spreadsheetweb.com/getting_started.htm"]
[{"$nulls":3},"Ignore the downloaded software, you will only need the username and password."]
[null,null,"6)","Visit the site below and login with your new account:"]
[{"$nulls":3},"https://www4.spreadsheetweb.com/SpreadsheetWEB//"]
[null,null,"7)","Click \"Add Web Application\" to upload this file. Your online sheet will be created automatically."]
[{"$nulls":3},"You can simply use the checklist from that link or place it on your website."]
[null,null,"8)","You can save your online Grade Sheet. Saved grade sheets can be reached using \"Data\" tab."]
[null,null,">>","Your online grade sheet will look like:"]
[{"$nulls":3},"https://www4.spreadsheetweb.com/SpreadSheetWEB/Output.aspx?ApplicationId=97b6a5be-441c-4e41-ad6d-f7f6d9fbd838"]
[null,null,">>","In order to see more online applications created with PSW you can check the link below:"]
[{"$nulls":3},"http://www.spreadsheetweb.com/demos.htm"]
[]
[]
[{"$nulls":3},"Copyright (c) 2009 Pagos, Inc., http://www.pagos.com/"]

{"sheet":"PSW_Sheet","index":2,"n_rows":11,"n_cols":11,"rows_kept":11,"hidden":true}
["%3c%3fxml+version%3d%221.0%22+encoding%3d%22utf-16%22%3f%3e%0d%0a%3cPageInputCells+xmlns%3axsi%3d%22http%3a%2f%2fwww.w3.org%2f2001%2fXMLSchema-instance%22+xmlns%3axsd%3d%22http%3a%2f%2fwww.w3.org%2f2001%2fXMLSchema%22%3e%0d%0a++%3cInputCells+InputPrefix%3d%22PSWInput_%22+ListPrefix%3d%22PSWList_%22+CellCount%3d%224%22%3e%0d%0a++++%3cCells%3e%0d%0a++++++%3cAddress%3e%3d'Grade+Sheet'!%24G%247%3c%2fAddress%3e%0d%0a++++++%3cListItemsAddress%3e%3d'Grade+Sheet'!%24G%247%3a%24L%2431%3c%2fListItemsAddress%3e%0d%0a++++++%3cNameIndex%3e0%3c%2fNameIndex%3e%0d%0a++++++%3cIsHidingEnabled%3efalse%3c%2fIsHidingEnabled%3e%0d%0a++++++%3cIsDisablingEnabled%3efalse%3c%2fIsDisablingEnabled%3e%0d%0a++++++%3cRequiresValidation%3efalse%3c%2fRequiresValidation%3e%0d%0a++++++%3cIsRequired%3efalse%3c%2fIsRequired%3e%0d%0a++++++%3cType%3eGrid%3c%2fType%3e%0d%0a++++++%3cDefaultValue+%2f%3e%0d%0a++++++%3cValueType+%2f%3e%0d%0a++++%3c%2fCells%3e%0d%0a++++%3cCells%3e%0d%0a++++++%3cAddress%3e%3d'Grade+Sheet'!%24N%247%3c%2fAddress%3e%0d%0a++++++%3cListItemsAddress%3e%3d'Grade+Sheet'!%24N%247%3a%24O%2431%3c%2fListItemsAddress%3e%0d%0a++++++%3cNameIndex%3e1%3c%2fNameIndex%3e%0d%0a++++++%3cIsHidingEnabled%3efalse%3c%2fIsHidingEnabled%3e%0d%0a++++++%3cIsDisablingEnabled%3efalse%3c%2fIsDisablingEnabled%3e%0d%0a++++++%3cRequiresValidation%3efalse%3c%2fRequiresValidation%3e%0d%0a++++++%3cIsRequired%3efalse%3c%2fIsRequired%3e%0d%0a++++++%3cType%3eGrid%3c%2fType%3e%0d%0a++++++%3cDefaultValue+%2f%3e%0d%0a++++++%3cValueType+%2f%3e%0d%0a++++%3c%2fCells%3e%0d%0a++++%3cCells%3e%0d%0a++++++%3cAddress%3e%3d'Grade+Sheet'!%24Q%247%3c%2fAddress%3e%0d%0a++++++%3cListItemsAddress%3e%3d'Grade+Sheet'!%24Q%247%3a%24S%2431%3c%2fListItemsAddress%3e%0d%0a++++++%3cNameIndex%3e2%3c%2fNameIndex%3e%0d%0a++++++%3cIsHidingEnabled%3efalse%3c%2fIsHidingEnabled%3e%0d%0a++++++%3cIsDisablingEnabled%3efalse%3c%2fIsDisablingEnabled%3e%0d%0a++++++%3cRequiresValidation%3efalse%3c%2fRequiresValidation%3e%0d%0a++++++%3cIsRequired%3efalse%3c%2fIsRequired%3e%0d%0a++++++%3cType%3eGrid%3c%2fType%3e%0d%0a++++++%3cDefaultValue+%2f%3e%0d%0a++++++%3cValueType+%2f%3e%0d%0a++++%3c%2fCells%3e%0d%0a++++%3cCells%3e%0d%0a++++++%3cAddress%3e%3d'Grade+Sheet'!%24U%247%3c%2fAddress%3e%0d%0a++++++%3cListItemsAddress%3e%3d'Grade+Sheet'!%24U%247%3a%24AD%2431%3c%2fListItemsAddress%3e%0d%0a++++++%3cNameIndex%3e3%3c%2fNameIndex%3e%0d%0a++++++%3cIsHidingEnabled%3efalse%3c%2fIsHidingEnabled%3e%0d%0a++++++%3cIsDisablingEnabled%3efalse%3c%2fIsDisablingEnabled%3e%0d%0a++++++%3cRequiresValidation%3efalse%3c%2fRequiresValidation%3e%0d%0a++++++%3cIsRequired%3efalse%3c%2fIsRequired%3e%0d%0a++++++%3cType%3eGrid%3c%2fType%3e%0d%0a++++++%3cDefaultValue+%2f%3e%0d%0a++++++%3cValueType+%2f%3e%0d%0a++++%3c%2fCells%3e%0d%0a++%3c%2fInputCells%3e%0d%0a%3c%2fPageInputCells%3e"]
[{"$cut":{"chars":32761,"head":" %3c%3fxml+version%3d%221.0%22+encoding%3d%22utf-16%22%3f%3e%0d%0a%3cTables+xmlns%3axsi%3d%22http%3a%2f%2fwww.w3.org%2f2001%2fXMLSchema-instance%22+xmlns%3axsd%3d%22http%3a%2f%2fwww.w3.org%2f2001%2fXMLSchema%22+InputPrefix%3d%22PSWInput_%22%3e%0d%0a++%3cTable+Name%3d%22PSWOutput_0%22+ColumnWidths%3d%2224.75-30.75-24.75-24.75-24.75-24.75-30-30-30-30-30-30-30-30-30-30-30-30-30-30-30-30-30-30-30-30-30-30-30-30-30-24.75-24.75-24.75-24.75-24.75%22+RowCount%3d%2233%22+Width%3d%221028.25%22+InputPrefix%3d%22PSWInput_%22%3e%0d%0a++++%3cTR%3e%0d%0a++++++%3cTD+Style%3d%22Class176%22+Merge%3d%22False%22+RowSpan%3d%22%22+ColSpan%3d%22%22+Format%3d%22General%22+Width%3d%2224.75%22+Text%3d%22%22+Height%3d%2215%22+Align%3d%22Left%22+CellHasFormula%3d%22False%22+FontName%3d%22Calibri%22+WrapText%3d%22False%22+FontSize%3d%2211%22+X%3d%221%22+Y%3d%221%22+%2f%3e%0d%0a++++++%3cTD+Style%3d%22Class176%22+Merge%3d%22False%22+RowSpan%3d%22%22+ColSpan%3d%22%22+Format%3d%22General%22+Width%3d%2230.75%22+Text%3d%22%22+Height%3d%2215%22+Align%3d%22Left%22+CellHasFormula%3d%22False%22+FontName%3d%22Calibri%22+WrapText%3d%22False%22+FontSize%3d%2211%22+X%3d%222%22+Y%3d%221%22+%2f%3e%0d%0a++++++%3cTD+Style%3d%22Class176%22+Merge%3d%22False%22+RowSpan%3d%22%22+ColSpan%3d%22%22+Format%3d%22General%22+Width%3d%2224.75%22+Text%3d%22%22+Height%3d%2215%22+Align%3d%22Left%22+CellHasFormula%3d%22False%22+FontName%3d%22Calibri%22+WrapText%3d%22False%22+FontSize%3d%2211%22+X%3d%223%22+Y%3d%221%22+%2f%3e%0d%0a++++++%3cTD+Style%3d%22Class176%22+Merge%3d%22False%22+RowSpan%3d%22%22+ColSpan%3d%22%22+Format%3d%22General%22+Width%3d%2224.75%22+Text%3d%22%22+Height%3d%2215%22+Align%3d%22Left%22+CellHasFormula%3d%22False%22+FontName%3d%22Calibri%22+WrapText%3d%22False%22+FontSize%3d%2211%22+X%3d%224%22+Y%3d%221%22+%2f%3e%0d%0a++++++%3cTD+Style%3d%22Class176%22+Merge%3d%22False%22+RowSpan%3d%22%22+ColSpan%3d%22%22+Format%3d%22General%22+Width%3d%2224.75%22+Text%3d%22%22+Height%3d%2215%22+Align%3d%22Left%22+CellHasFormula%3d%22False%22+FontName%3d%22Calibri%22+WrapText%3d%22False%22+FontSize%3d%2211%22+X%3d%225%22+Y%3d%221%22+%2f%3e%0d%0a++++++%3cTD+Style%3d%22Class176%22+Merge%3d%22False%22+RowSpan%3d%22%22+ColSpan%3d%22%22+Format%3d%22General%22+Width%3d%2224.75%22+Text%3d%22%22+Height%3d%2215%22+Align%3d%22Left%22+CellHasFormula%3d%22False%22+FontName%3d%22Calibri%22+WrapText%3d%22False%22+FontSize%3d%2211%22+X%3d%226%22+Y%3d%221%22+%2f%3e%0d%0a++++++%3cTD+Style%3d%22Class176%22+Merge%3d%22False%22+RowSpan%3d%22%22+ColSpan%3d%22%22+Format%3d%22General%22+Width%3d%2230%22+Text%3d%22%22+Height%3d%2215%22+Align%3d%22Left%22+CellHasFormula%3d%22False%22+FontName%3d%22Calibri%22+WrapText%3d%22False%22+FontSize%3d%2211%22+X%3d%227%22+Y%3d%221%22+%2f%3e%0d%0a++++++%3cTD+Style%3d%22Class176%22+Merge%3d%22False%22+RowSpan%3d%22%22+ColSpan%3d%22%22+Format%3d%22General%22+Width%3d%2230%22+Text%3d%22%22+Height%3d%2215%22+Align%3d%22Left%22+CellHasFormula%3d%22False%22+FontName%3d%22Calibri%22+WrapText%3d%22False%22+FontSize%3d%2211%22+X%3d%228%22+Y%3d%221%22+%2f%3e%0d%0a++++++%3cTD+Style%3d%22Class176%22+Merge%3d%22False%22+RowSpan%3d%22%22+ColSpan%3d%22%22+Format%3d%22General%22+Width%3d%2230%22+Text%3d%22%22+Height%3d%2215%22+Align%3d%22Left%22+CellHasFormula%3d%22False%22+FontName%3d%22Calibri%22+WrapText%3d%22False%22+FontSize%3d%2211%22+X%3d%229%22+Y%3d%221%22+%2f%3e%0d%0a++++++%3cTD+Style%3d%22Class176%22+Merge%3d%22False%22+RowSpan%3d%22%22+ColSpan%3d%22%22+Format%3d%22General%22+Width%3d%2230%22+Text%3d%22%22+Height%3d%2215%22+Align%3d%22Left%22+CellHasFormula%3d%22False%22+FontName%3d%22Calibri%22+WrapText%3d%22False%22+FontSize%3d%2211%22+X%3d%2210%22+Y%3d%221%22+%2f%3e%0d%0a++++++%3cTD+Style%3d%22Class176%22+Merge%3d%22False%22+RowSpan%3d%22%22+ColSpan%3d%22%22+Format%3d%22General%22+Width%3d%2230%22+Text%3d%22%22+Height%3d%2215%22+Align%3d%22Left%22+CellHasFormula%3d%22False%22+FontName%3d%22Calibri%22+WrapText%3d%22False%22+FontSize%3d%2211%22+X%3d%2211%22+Y%3d%221%22+%2f%3e%0d%0a++++++%3cTD+Style%3d%22Class176%22+Merge%3d%22False%22+RowSpan%3d%22%22+ColSpan%3d%22%22"}},{"$cut":{"chars":32761,"head":" +%3cTD+Style%3d%22Class178%22+Merge%3d%22False%22+RowSpan%3d%22%22+ColSpan%3d%22%22+Format%3d%22General%22+Width%3d%2224.75%22+Text%3d%22%22+Height%3d%2215.75%22+Align%3d%22Left%22+CellHasFormula%3d%22False%22+FontName%3d%22Calibri%22+WrapText%3d%22False%22+FontSize%3d%2211%22+X%3d%223%22+Y%3d%224%22+%2f%3e%0d%0a++++++%3cTD+Style%3d%22Class178%22+Merge%3d%22False%22+RowSpan%3d%22%22+ColSpan%3d%22%22+Format%3d%22General%22+Width%3d%2224.75%22+Text%3d%22%22+Height%3d%2215.75%22+Align%3d%22Left%22+CellHasFormula%3d%22False%22+FontName%3d%22Calibri%22+WrapText%3d%22False%22+FontSize%3d%2211%22+X%3d%224%22+Y%3d%224%22+%2f%3e%0d%0a++++++%3cTD+Style%3d%22Class178%22+Merge%3d%22False%22+RowSpan%3d%22%22+ColSpan%3d%22%22+Format%3d%22General%22+Width%3d%2224.75%22+Text%3d%22%22+Height%3d%2215.75%22+Align%3d%22Left%22+CellHasFormula%3d%22False%22+FontName%3d%22Calibri%22+WrapText%3d%22False%22+FontSize%3d%2211%22+X%3d%225%22+Y%3d%224%22+%2f%3e%0d%0a++++++%3cTD+Style%3d%22Class178%22+Merge%3d%22False%22+RowSpan%3d%22%22+ColSpan%3d%22%22+Format%3d%22General%22+Width%3d%2224.75%22+Text%3d%22%22+Height%3d%2215.75%22+Align%3d%22Left%22+CellHasFormula%3d%22False%22+FontName%3d%22Calibri%22+WrapText%3d%22False%22+FontSize%3d%2211%22+X%3d%226%22+Y%3d%224%22+%2f%3e%0d%0a++++++%3cTD+Style%3d%22Class178%22+Merge%3d%22False%22+RowSpan%3d%22%22+ColSpan%3d%22%22+Format%3d%22General%22+Width%3d%2230%22+Text%3d%22%22+Height%3d%2215.75%22+Align%3d%22Left%22+CellHasFormula%3d%22False%22+FontName%3d%22Calibri%22+WrapText%3d%22False%22+FontSize%3d%2211%22+X%3d%227%22+Y%3d%224%22+%2f%3e%0d%0a++++++%3cTD+Style%3d%22Class178%22+Merge%3d%22False%22+RowSpan%3d%22%22+ColSpan%3d%22%22+Format%3d%22General%22+Width%3d%2230%22+Text%3d%22%22+Height%3d%2215.75%22+Align%3d%22Left%22+CellHasFormula%3d%22False%22+FontName%3d%22Calibri%22+WrapText%3d%22False%22+FontSize%3d%2211%22+X%3d%228%22+Y%3d%224%22+%2f%3e%0d%0a++++++%3cTD+Style%3d%22Class178%22+Merge%3d%22False%22+RowSpan%3d%22%22+ColSpan%3d%22%22+Format%3d%22General%22+Width%3d%2230%22+Text%3d%22%22+Height%3d%2215.75%22+Align%3d%22Left%22+CellHasFormula%3d%22False%22+FontName%3d%22Calibri%22+WrapText%3d%22False%22+FontSize%3d%2211%22+X%3d%229%22+Y%3d%224%22+%2f%3e%0d%0a++++++%3cTD+Style%3d%22Class178%22+Merge%3d%22False%22+RowSpan%3d%22%22+ColSpan%3d%22%22+Format%3d%22General%22+Width%3d%2230%22+Text%3d%22%22+Height%3d%2215.75%22+Align%3d%22Left%22+CellHasFormula%3d%22False%22+FontName%3d%22Calibri%22+WrapText%3d%22False%22+FontSize%3d%2211%22+X%3d%2210%22+Y%3d%224%22+%2f%3e%0d%0a++++++%3cTD+Style%3d%22Class178%22+Merge%3d%22False%22+RowSpan%3d%22%22+ColSpan%3d%22%22+Format%3d%22General%22+Width%3d%2230%22+Text%3d%22%22+Height%3d%2215.75%22+Align%3d%22Left%22+CellHasFormula%3d%22False%22+FontName%3d%22Calibri%22+WrapText%3d%22False%22+FontSize%3d%2211%22+X%3d%2211%22+Y%3d%224%22+%2f%3e%0d%0a++++++%3cTD+Style%3d%22Class178%22+Merge%3d%22False%22+RowSpan%3d%22%22+ColSpan%3d%22%22+Format%3d%22General%22+Width%3d%2230%22+Text%3d%22%22+Height%3d%2215.75%22+Align%3d%22Left%22+CellHasFormula%3d%22False%22+FontName%3d%22Calibri%22+WrapText%3d%22False%22+FontSize%3d%2211%22+X%3d%2212%22+Y%3d%224%22+%2f%3e%0d%0a++++++%3cTD+Style%3d%22Class178%22+Merge%3d%22False%22+RowSpan%3d%22%22+ColSpan%3d%22%22+Format%3d%22General%22+Width%3d%2230%22+Text%3d%22%22+Height%3d%2215.75%22+Align%3d%22Left%22+CellHasFormula%3d%22False%22+FontName%3d%22Calibri%22+WrapText%3d%22False%22+FontSize%3d%2211%22+X%3d%2213%22+Y%3d%224%22+%2f%3e%0d%0a++++++%3cTD+Style%3d%22Class178%22+Merge%3d%22False%22+RowSpan%3d%22%22+ColSpan%3d%22%22+Format%3d%22General%22+Width%3d%2230%22+Text%3d%22%22+Height%3d%2215.75%22+Align%3d%22Left%22+CellHasFormula%3d%22False%22+FontName%3d%22Calibri%22+WrapText%3d%22False%22+FontSize%3d%2211%22+X%3d%2214%22+Y%3d%224%22+%2f%3e%0d%0a++++++%3cTD+Style%3d%22Class178%22+Merge%3d%22False%22+RowSpan%3d%22%22+ColSpan%3d%22%22+Format%3d%22General%22+Width%3d%2230%22+Text%3d%22%22+Height%3d%2215.75%22+Align%3d%22Left%22+CellHasFormula%3d%22False%22+FontName%3d%22Calibri%22+WrapText%3d%22False%22+FontSize%3d%2211%22+X%3d%2215%2"}},{"$cut":{"chars":32761,"head":" rapText%3d%22False%22+FontSize%3d%229%22+X%3d%2211%22+Y%3d%2210%22+%2f%3e%0d%0a++++++++++%3cGridCell+Style%3d%22Class194%22+Merge%3d%22False%22+RowSpan%3d%22%22+ColSpan%3d%22%22+Format%3d%22General%22+Width%3d%2230%22+Text%3d%22%22+Height%3d%2215%22+Align%3d%22Center%22+CellHasFormula%3d%22False%22+FontName%3d%22Calibri%22+WrapText%3d%22False%22+FontSize%3d%229%22+X%3d%2212%22+Y%3d%2210%22+%2f%3e%0d%0a++++++++++%3cGridCell+Style%3d%22Class193%22+Merge%3d%22False%22+RowSpan%3d%22%22+ColSpan%3d%22%22+Format%3d%22General%22+Width%3d%2230%22+Text%3d%22%22+Height%3d%2215%22+Align%3d%22Center%22+CellHasFormula%3d%22False%22+FontName%3d%22Calibri%22+WrapText%3d%22False%22+FontSize%3d%229%22+X%3d%227%22+Y%3d%2211%22+%2f%3e%0d%0a++++++++++%3cGridCell+Style%3d%22Class194%22+Merge%3d%22False%22+RowSpan%3d%22%22+ColSpan%3d%22%22+Format%3d%22General%22+Width%3d%2230%22+Text%3d%22%22+Height%3d%2215%22+Align%3d%22Center%22+CellHasFormula%3d%22False%22+FontName%3d%22Calibri%22+WrapText%3d%22False%22+FontSize%3d%229%22+X%3d%228%22+Y%3d%2211%22+%2f%3e%0d%0a++++++++++%3cGridCell+Style%3d%22Class194%22+Merge%3d%22False%22+RowSpan%3d%22%22+ColSpan%3d%22%22+Format%3d%22General%22+Width%3d%2230%22+Text%3d%22%22+Height%3d%2215%22+Align%3d%22Center%22+CellHasFormula%3d%22False%22+FontName%3d%22Calibri%22+WrapText%3d%22False%22+FontSize%3d%229%22+X%3d%229%22+Y%3d%2211%22+%2f%3e%0d%0a++++++++++%3cGridCell+Style%3d%22Class194%22+Merge%3d%22False%22+RowSpan%3d%22%22+ColSpan%3d%22%22+Format%3d%22General%22+Width%3d%2230%22+Text%3d%22%22+Height%3d%2215%22+Align%3d%22Center%22+CellHasFormula%3d%22False%22+FontName%3d%22Calibri%22+WrapText%3d%22False%22+FontSize%3d%229%22+X%3d%2210%22+Y%3d%2211%22+%2f%3e%0d%0a++++++++++%3cGridCell+Style%3d%22Class194%22+Merge%3d%22False%22+RowSpan%3d%22%22+ColSpan%3d%22%22+Format%3d%22General%22+Width%3d%2230%22+Text%3d%22%22+Height%3d%2215%22+Align%3d%22Center%22+CellHasFormula%3d%22False%22+FontName%3d%22Calibri%22+WrapText%3d%22False%22+FontSize%3d%229%22+X%3d%2211%22+Y%3d%2211%22+%2f%3e%0d%0a++++++++++%3cGridCell+Style%3d%22Class194%22+Merge%3d%22False%22+RowSpan%3d%22%22+ColSpan%3d%22%22+Format%3d%22General%22+Width%3d%2230%22+Text%3d%22%22+Height%3d%2215%22+Align%3d%22Center%22+CellHasFormula%3d%22False%22+FontName%3d%22Calibri%22+WrapText%3d%22False%22+FontSize%3d%229%22+X%3d%2212%22+Y%3d%2211%22+%2f%3e%0d%0a++++++++++%3cGridCell+Style%3d%22Class193%22+Merge%3d%22False%22+RowSpan%3d%22%22+ColSpan%3d%22%22+Format%3d%22General%22+Width%3d%2230%22+Text%3d%22%22+Height%3d%2215%22+Align%3d%22Center%22+CellHasFormula%3d%22False%22+FontName%3d%22Calibri%22+WrapText%3d%22False%22+FontSize%3d%229%22+X%3d%227%22+Y%3d%2212%22+%2f%3e%0d%0a++++++++++%3cGridCell+Style%3d%22Class194%22+Merge%3d%22False%22+RowSpan%3d%22%22+ColSpan%3d%22%22+Format%3d%22General%22+Width%3d%2230%22+Text%3d%22%22+Height%3d%2215%22+Align%3d%22Center%22+CellHasFormula%3d%22False%22+FontName%3d%22Calibri%22+WrapText%3d%22False%22+FontSize%3d%229%22+X%3d%228%22+Y%3d%2212%22+%2f%3e%0d%0a++++++++++%3cGridCell+Style%3d%22Class194%22+Merge%3d%22False%22+RowSpan%3d%22%22+ColSpan%3d%22%22+Format%3d%22General%22+Width%3d%2230%22+Text%3d%22%22+Height%3d%2215%22+Align%3d%22Center%22+CellHasFormula%3d%22False%22+FontName%3d%22Calibri%22+WrapText%3d%22False%22+FontSize%3d%229%22+X%3d%229%22+Y%3d%2212%22+%2f%3e%0d%0a++++++++++%3cGridCell+Style%3d%22Class194%22+Merge%3d%22False%22+RowSpan%3d%22%22+ColSpan%3d%22%22+Format%3d%22General%22+Width%3d%2230%22+Text%3d%22%22+Height%3d%2215%22+Align%3d%22Center%22+CellHasFormula%3d%22False%22+FontName%3d%22Calibri%22+WrapText%3d%22False%22+FontSize%3d%229%22+X%3d%2210%22+Y%3d%2212%22+%2f%3e%0d%0a++++++++++%3cGridCell+Style%3d%22Class194%22+Merge%3d%22False%22+RowSpan%3d%22%22+ColSpan%3d%22%22+Format%3d%22General%22+Width%3d%2230%22+Text%3d%22%22+Height%3d%2215%22+Align%3d%22Center%22+CellHasFormula%3d%22False%22+FontName%3d%22Calibri%22+WrapText%3d%22False%22+FontSize%3d%229%22+X%3d%2211%22+Y%3d%2212%22+%2f%3e%0d%0a++++++++++%3cGridCell+Style%3d%22Class194%22+Merge%3d%22False%22+RowSpan%3d%22%22+ColSpan%3d%22%22+Format%3d%2"}},{"$cut":{"chars":32761,"head":" 230%22+Text%3d%22%22+Height%3d%2215%22+Align%3d%22Center%22+CellHasFormula%3d%22False%22+FontName%3d%22Calibri%22+WrapText%3d%22False%22+FontSize%3d%229%22+X%3d%2210%22+Y%3d%2227%22+%2f%3e%0d%0a++++++++++%3cGridCell+Style%3d%22Class194%22+Merge%3d%22False%22+RowSpan%3d%22%22+ColSpan%3d%22%22+Format%3d%22General%22+Width%3d%2230%22+Text%3d%22%22+Height%3d%2215%22+Align%3d%22Center%22+CellHasFormula%3d%22False%22+FontName%3d%22Calibri%22+WrapText%3d%22False%22+FontSize%3d%229%22+X%3d%2211%22+Y%3d%2227%22+%2f%3e%0d%0a++++++++++%3cGridCell+Style%3d%22Class194%22+Merge%3d%22False%22+RowSpan%3d%22%22+ColSpan%3d%22%22+Format%3d%22General%22+Width%3d%2230%22+Text%3d%22%22+Height%3d%2215%22+Align%3d%22Center%22+CellHasFormula%3d%22False%22+FontName%3d%22Calibri%22+WrapText%3d%22False%22+FontSize%3d%229%22+X%3d%2212%22+Y%3d%2227%22+%2f%3e%0d%0a++++++++++%3cGridCell+Style%3d%22Class193%22+Merge%3d%22False%22+RowSpan%3d%22%22+ColSpan%3d%22%22+Format%3d%22General%22+Width%3d%2230%22+Text%3d%22%22+Height%3d%2215%22+Align%3d%22Center%22+CellHasFormula%3d%22False%22+FontName%3d%22Calibri%22+WrapText%3d%22False%22+FontSize%3d%229%22+X%3d%227%22+Y%3d%2228%22+%2f%3e%0d%0a++++++++++%3cGridCell+Style%3d%22Class194%22+Merge%3d%22False%22+RowSpan%3d%22%22+ColSpan%3d%22%22+Format%3d%22General%22+Width%3d%2230%22+Text%3d%22%22+Height%3d%2215%22+Align%3d%22Center%22+CellHasFormula%3d%22False%22+FontName%3d%22Calibri%22+WrapText%3d%22False%22+FontSize%3d%229%22+X%3d%228%22+Y%3d%2228%22+%2f%3e%0d%0a++++++++++%3cGridCell+Style%3d%22Class194%22+Merge%3d%22False%22+RowSpan%3d%22%22+ColSpan%3d%22%22+Format%3d%22General%22+Width%3d%2230%22+Text%3d%22%22+Height%3d%2215%22+Align%3d%22Center%22+CellHasFormula%3d%22False%22+FontName%3d%22Calibri%22+WrapText%3d%22False%22+FontSize%3d%229%22+X%3d%229%22+Y%3d%2228%22+%2f%3e%0d%0a++++++++++%3cGridCell+Style%3d%22Class194%22+Merge%3d%22False%22+RowSpan%3d%22%22+ColSpan%3d%22%22+Format%3d%22General%22+Width%3d%2230%22+Text%3d%22%22+Height%3d%2215%22+Align%3d%22Center%22+CellHasFormula%3d%22False%22+FontName%3d%22Calibri%22+WrapText%3d%22False%22+FontSize%3d%229%22+X%3d%2210%22+Y%3d%2228%22+%2f%3e%0d%0a++++++++++%3cGridCell+Style%3d%22Class194%22+Merge%3d%22False%22+RowSpan%3d%22%22+ColSpan%3d%22%22+Format%3d%22General%22+Width%3d%2230%22+Text%3d%22%22+Height%3d%2215%22+Align%3d%22Center%22+CellHasFormula%3d%22False%22+FontName%3d%22Calibri%22+WrapText%3d%22False%22+FontSize%3d%229%22+X%3d%2211%22+Y%3d%2228%22+%2f%3e%0d%0a++++++++++%3cGridCell+Style%3d%22Class194%22+Merge%3d%22False%22+RowSpan%3d%22%22+ColSpan%3d%22%22+Format%3d%22General%22+Width%3d%2230%22+Text%3d%22%22+Height%3d%2215%22+Align%3d%22Center%22+CellHasFormula%3d%22False%22+FontName%3d%22Calibri%22+WrapText%3d%22False%22+FontSize%3d%229%22+X%3d%2212%22+Y%3d%2228%22+%2f%3e%0d%0a++++++++++%3cGridCell+Style%3d%22Class193%22+Merge%3d%22False%22+RowSpan%3d%22%22+ColSpan%3d%22%22+Format%3d%22General%22+Width%3d%2230%22+Text%3d%22%22+Height%3d%2215%22+Align%3d%22Center%22+CellHasFormula%3d%22False%22+FontName%3d%22Calibri%22+WrapText%3d%22False%22+FontSize%3d%229%22+X%3d%227%22+Y%3d%2229%22+%2f%3e%0d%0a++++++++++%3cGridCell+Style%3d%22Class194%22+Merge%3d%22False%22+RowSpan%3d%22%22+ColSpan%3d%22%22+Format%3d%22General%22+Width%3d%2230%22+Text%3d%22%22+Height%3d%2215%22+Align%3d%22Center%22+CellHasFormula%3d%22False%22+FontName%3d%22Calibri%22+WrapText%3d%22False%22+FontSize%3d%229%22+X%3d%228%22+Y%3d%2229%22+%2f%3e%0d%0a++++++++++%3cGridCell+Style%3d%22Class194%22+Merge%3d%22False%22+RowSpan%3d%22%22+ColSpan%3d%22%22+Format%3d%22General%22+Width%3d%2230%22+Text%3d%22%22+Height%3d%2215%22+Align%3d%22Center%22+CellHasFormula%3d%22False%22+FontName%3d%22Calibri%22+WrapText%3d%22False%22+FontSize%3d%229%22+X%3d%229%22+Y%3d%2229%22+%2f%3e%0d%0a++++++++++%3cGridCell+Style%3d%22Class194%22+Merge%3d%22False%22+RowSpan%3d%22%22+ColSpan%3d%22%22+Format%3d%22General%22+Width%3d%2230%22+Text%3d%22%22+Height%3d%2215%22+Align%3d%22Center%22+CellHasFormula%3d%22False%22+FontName%3d%22Calibri%22+WrapText%3d%22False%22+FontSize%3d%229%22+X%3d%2210%22+Y%3d%2229%22+%2f%3e%"}},{"$cut":{"chars":32761,"head":" Format%3d%22General%22+Width%3d%2230%22+Text%3d%22%22+Height%3d%2215%22+Align%3d%22Center%22+CellHasFormula%3d%22False%22+FontName%3d%22Calibri%22+WrapText%3d%22False%22+FontSize%3d%229%22+X%3d%2217%22+Y%3d%2212%22+%2f%3e%0d%0a++++++++++%3cGridCell+Style%3d%22Class194%22+Merge%3d%22False%22+RowSpan%3d%22%22+ColSpan%3d%22%22+Format%3d%22General%22+Width%3d%2230%22+Text%3d%22%22+Height%3d%2215%22+Align%3d%22Center%22+CellHasFormula%3d%22False%22+FontName%3d%22Calibri%22+WrapText%3d%22False%22+FontSize%3d%229%22+X%3d%2218%22+Y%3d%2212%22+%2f%3e%0d%0a++++++++++%3cGridCell+Style%3d%22Class194%22+Merge%3d%22False%22+RowSpan%3d%22%22+ColSpan%3d%22%22+Format%3d%22General%22+Width%3d%2230%22+Text%3d%22%22+Height%3d%2215%22+Align%3d%22Center%22+CellHasFormula%3d%22False%22+FontName%3d%22Calibri%22+WrapText%3d%22False%22+FontSize%3d%229%22+X%3d%2219%22+Y%3d%2212%22+%2f%3e%0d%0a++++++++++%3cGridCell+Style%3d%22Class193%22+Merge%3d%22False%22+RowSpan%3d%22%22+ColSpan%3d%22%22+Format%3d%22General%22+Width%3d%2230%22+Text%3d%22%22+Height%3d%2215%22+Align%3d%22Center%22+CellHasFormula%3d%22False%22+FontName%3d%22Calibri%22+WrapText%3d%22False%22+FontSize%3d%229%22+X%3d%2217%22+Y%3d%2213%22+%2f%3e%0d%0a++++++++++%3cGridCell+Style%3d%22Class194%22+Merge%3d%22False%22+RowSpan%3d%22%22+ColSpan%3d%22%22+Format%3d%22General%22+Width%3d%2230%22+Text%3d%22%22+Height%3d%2215%22+Align%3d%22Center%22+CellHasFormula%3d%22False%22+FontName%3d%22Calibri%22+WrapText%3d%22False%22+FontSize%3d%229%22+X%3d%2218%22+Y%3d%2213%22+%2f%3e%0d%0a++++++++++%3cGridCell+Style%3d%22Class194%22+Merge%3d%22False%22+RowSpan%3d%22%22+ColSpan%3d%22%22+Format%3d%22General%22+Width%3d%2230%22+Text%3d%22%22+Height%3d%2215%22+Align%3d%22Center%22+CellHasFormula%3d%22False%22+FontName%3d%22Calibri%22+WrapText%3d%22False%22+FontSize%3d%229%22+X%3d%2219%22+Y%3d%2213%22+%2f%3e%0d%0a++++++++++%3cGridCell+Style%3d%22Class193%22+Merge%3d%22False%22+RowSpan%3d%22%22+ColSpan%3d%22%22+Format%3d%22General%22+Width%3d%2230%22+Text%3d%22%22+Height%3d%2215%22+Align%3d%22Center%22+CellHasFormula%3d%22False%22+FontName%3d%22Calibri%22+WrapText%3d%22False%22+FontSize%3d%229%22+X%3d%2217%22+Y%3d%2214%22+%2f%3e%0d%0a++++++++++%3cGridCell+Style%3d%22Class194%22+Merge%3d%22False%22+RowSpan%3d%22%22+ColSpan%3d%22%22+Format%3d%22General%22+Width%3d%2230%22+Text%3d%22%22+Height%3d%2215%22+Align%3d%22Center%22+CellHasFormula%3d%22False%22+FontName%3d%22Calibri%22+WrapText%3d%22False%22+FontSize%3d%229%22+X%3d%2218%22+Y%3d%2214%22+%2f%3e%0d%0a++++++++++%3cGridCell+Style%3d%22Class194%22+Merge%3d%22False%22+RowSpan%3d%22%22+ColSpan%3d%22%22+Format%3d%22General%22+Width%3d%2230%22+Text%3d%22%22+Height%3d%2215%22+Align%3d%22Center%22+CellHasFormula%3d%22False%22+FontName%3d%22Calibri%22+WrapText%3d%22False%22+FontSize%3d%229%22+X%3d%2219%22+Y%3d%2214%22+%2f%3e%0d%0a++++++++++%3cGridCell+Style%3d%22Class193%22+Merge%3d%22False%22+RowSpan%3d%22%22+ColSpan%3d%22%22+Format%3d%22General%22+Width%3d%2230%22+Text%3d%22%22+Height%3d%2215%22+Align%3d%22Center%22+CellHasFormula%3d%22False%22+FontName%3d%22Calibri%22+WrapText%3d%22False%22+FontSize%3d%229%22+X%3d%2217%22+Y%3d%2215%22+%2f%3e%0d%0a++++++++++%3cGridCell+Style%3d%22Class194%22+Merge%3d%22False%22+RowSpan%3d%22%22+ColSpan%3d%22%22+Format%3d%22General%22+Width%3d%2230%22+Text%3d%22%22+Height%3d%2215%22+Align%3d%22Center%22+CellHasFormula%3d%22False%22+FontName%3d%22Calibri%22+WrapText%3d%22False%22+FontSize%3d%229%22+X%3d%2218%22+Y%3d%2215%22+%2f%3e%0d%0a++++++++++%3cGridCell+Style%3d%22Class194%22+Merge%3d%22False%22+RowSpan%3d%22%22+ColSpan%3d%22%22+Format%3d%22General%22+Width%3d%2230%22+Text%3d%22%22+Height%3d%2215%22+Align%3d%22Center%22+CellHasFormula%3d%22False%22+FontName%3d%22Calibri%22+WrapText%3d%22False%22+FontSize%3d%229%22+X%3d%2219%22+Y%3d%2215%22+%2f%3e%0d%0a++++++++++%3cGridCell+Style%3d%22Class193%22+Merge%3d%22False%22+RowSpan%3d%22%22+ColSpan%3d%22%22+Format%3d%22General%22+Width%3d%2230%22+Text%3d%22%22+Height%3d%2215%22+Align%3d%22Center%22+CellHasFormula%3d%22False%22+FontName%3d%22Calibri%22+WrapText%3d%22False%22+FontSize%3d%2"}},{"$cut":{"chars":32761,"head":" Height%3d%2215%22+Align%3d%22Center%22+CellHasFormula%3d%22False%22+FontName%3d%22Calibri%22+WrapText%3d%22False%22+FontSize%3d%229%22+X%3d%2227%22+Y%3d%2210%22+%2f%3e%0d%0a++++++++++%3cGridCell+Style%3d%22Class194%22+Merge%3d%22False%22+RowSpan%3d%22%22+ColSpan%3d%22%22+Format%3d%22General%22+Width%3d%2230%22+Text%3d%22%22+Height%3d%2215%22+Align%3d%22Center%22+CellHasFormula%3d%22False%22+FontName%3d%22Calibri%22+WrapText%3d%22False%22+FontSize%3d%229%22+X%3d%2228%22+Y%3d%2210%22+%2f%3e%0d%0a++++++++++%3cGridCell+Style%3d%22Class194%22+Merge%3d%22False%22+RowSpan%3d%22%22+ColSpan%3d%22%22+Format%3d%22General%22+Width%3d%2230%22+Text%3d%22%22+Height%3d%2215%22+Align%3d%22Center%22+CellHasFormula%3d%22False%22+FontName%3d%22Calibri%22+WrapText%3d%22False%22+FontSize%3d%229%22+X%3d%2229%22+Y%3d%2210%22+%2f%3e%0d%0a++++++++++%3cGridCell+Style%3d%22Class194%22+Merge%3d%22False%22+RowSpan%3d%22%22+ColSpan%3d%22%22+Format%3d%22General%22+Width%3d%2230%22+Text%3d%22%22+Height%3d%2215%22+Align%3d%22Center%22+CellHasFormula%3d%22False%22+FontName%3d%22Calibri%22+WrapText%3d%22False%22+FontSize%3d%229%22+X%3d%2230%22+Y%3d%2210%22+%2f%3e%0d%0a++++++++++%3cGridCell+Style%3d%22Class193%22+Merge%3d%22False%22+RowSpan%3d%22%22+ColSpan%3d%22%22+Format%3d%22General%22+Width%3d%2230%22+Text%3d%22%22+Height%3d%2215%22+Align%3d%22Center%22+CellHasFormula%3d%22False%22+FontName%3d%22Calibri%22+WrapText%3d%22False%22+FontSize%3d%229%22+X%3d%2221%22+Y%3d%2211%22+%2f%3e%0d%0a++++++++++%3cGridCell+Style%3d%22Class194%22+Merge%3d%22False%22+RowSpan%3d%22%22+ColSpan%3d%22%22+Format%3d%22General%22+Width%3d%2230%22+Text%3d%22%22+Height%3d%2215%22+Align%3d%22Center%22+CellHasFormula%3d%22False%22+FontName%3d%22Calibri%22+WrapText%3d%22False%22+FontSize%3d%229%22+X%3d%2222%22+Y%3d%2211%22+%2f%3e%0d%0a++++++++++%3cGridCell+Style%3d%22Class194%22+Merge%3d%22False%22+RowSpan%3d%22%22+ColSpan%3d%22%22+Format%3d%22General%22+Width%3d%2230%22+Text%3d%22%22+Height%3d%2215%22+Align%3d%22Center%22+CellHasFormula%3d%22False%22+FontName%3d%22Calibri%22+WrapText%3d%22False%22+FontSize%3d%229%22+X%3d%2223%22+Y%3d%2211%22+%2f%3e%0d%0a++++++++++%3cGridCell+Style%3d%22Class194%22+Merge%3d%22False%22+RowSpan%3d%22%22+ColSpan%3d%22%22+Format%3d%22General%22+Width%3d%2230%22+Text%3d%22%22+Height%3d%2215%22+Align%3d%22Center%22+CellHasFormula%3d%22False%22+FontName%3d%22Calibri%22+WrapText%3d%22False%22+FontSize%3d%229%22+X%3d%2224%22+Y%3d%2211%22+%2f%3e%0d%0a++++++++++%3cGridCell+Style%3d%22Class194%22+Merge%3d%22False%22+RowSpan%3d%22%22+ColSpan%3d%22%22+Format%3d%22General%22+Width%3d%2230%22+Text%3d%22%22+Height%3d%2215%22+Align%3d%22Center%22+CellHasFormula%3d%22False%22+FontName%3d%22Calibri%22+WrapText%3d%22False%22+FontSize%3d%229%22+X%3d%2225%22+Y%3d%2211%22+%2f%3e%0d%0a++++++++++%3cGridCell+Style%3d%22Class194%22+Merge%3d%22False%22+RowSpan%3d%22%22+ColSpan%3d%22%22+Format%3d%22General%22+Width%3d%2230%22+Text%3d%22%22+Height%3d%2215%22+Align%3d%22Center%22+CellHasFormula%3d%22False%22+FontName%3d%22Calibri%22+WrapText%3d%22False%22+FontSize%3d%229%22+X%3d%2226%22+Y%3d%2211%22+%2f%3e%0d%0a++++++++++%3cGridCell+Style%3d%22Class194%22+Merge%3d%22False%22+RowSpan%3d%22%22+ColSpan%3d%22%22+Format%3d%22General%22+Width%3d%2230%22+Text%3d%22%22+Height%3d%2215%22+Align%3d%22Center%22+CellHasFormula%3d%22False%22+FontName%3d%22Calibri%22+WrapText%3d%22False%22+FontSize%3d%229%22+X%3d%2227%22+Y%3d%2211%22+%2f%3e%0d%0a++++++++++%3cGridCell+Style%3d%22Class194%22+Merge%3d%22False%22+RowSpan%3d%22%22+ColSpan%3d%22%22+Format%3d%22General%22+Width%3d%2230%22+Text%3d%22%22+Height%3d%2215%22+Align%3d%22Center%22+CellHasFormula%3d%22False%22+FontName%3d%22Calibri%22+WrapText%3d%22False%22+FontSize%3d%229%22+X%3d%2228%22+Y%3d%2211%22+%2f%3e%0d%0a++++++++++%3cGridCell+Style%3d%22Class194%22+Merge%3d%22False%22+RowSpan%3d%22%22+ColSpan%3d%22%22+Format%3d%22General%22+Width%3d%2230%22+Text%3d%22%22+Height%3d%2215%22+Align%3d%22Center%22+CellHasFormula%3d%22False%22+FontName%3d%22Calibri%22+WrapText%3d%22False%22+FontSize%3d%229%22+X%3d%2229%22+Y%3d%2211%22+%2f%3e%0d%0a++++++++++"}},{"$cut":{"chars":32761,"head":" +%2f%3e%0d%0a++++++++++%3cGridCell+Style%3d%22Class194%22+Merge%3d%22False%22+RowSpan%3d%22%22+ColSpan%3d%22%22+Format%3d%22General%22+Width%3d%2230%22+Text%3d%22%22+Height%3d%2215%22+Align%3d%22Center%22+CellHasFormula%3d%22False%22+FontName%3d%22Calibri%22+WrapText%3d%22False%22+FontSize%3d%229%22+X%3d%2228%22+Y%3d%2220%22+%2f%3e%0d%0a++++++++++%3cGridCell+Style%3d%22Class194%22+Merge%3d%22False%22+RowSpan%3d%22%22+ColSpan%3d%22%22+Format%3d%22General%22+Width%3d%2230%22+Text%3d%22%22+Height%3d%2215%22+Align%3d%22Center%22+CellHasFormula%3d%22False%22+FontName%3d%22Calibri%22+WrapText%3d%22False%22+FontSize%3d%229%22+X%3d%2229%22+Y%3d%2220%22+%2f%3e%0d%0a++++++++++%3cGridCell+Style%3d%22Class194%22+Merge%3d%22False%22+RowSpan%3d%22%22+ColSpan%3d%22%22+Format%3d%22General%22+Width%3d%2230%22+Text%3d%22%22+Height%3d%2215%22+Align%3d%22Center%22+CellHasFormula%3d%22False%22+FontName%3d%22Calibri%22+WrapText%3d%22False%22+FontSize%3d%229%22+X%3d%2230%22+Y%3d%2220%22+%2f%3e%0d%0a++++++++++%3cGridCell+Style%3d%22Class193%22+Merge%3d%22False%22+RowSpan%3d%22%22+ColSpan%3d%22%22+Format%3d%22General%22+Width%3d%2230%22+Text%3d%22%22+Height%3d%2215%22+Align%3d%22Center%22+CellHasFormula%3d%22False%22+FontName%3d%22Calibri%22+WrapText%3d%22False%22+FontSize%3d%229%22+X%3d%2221%22+Y%3d%2221%22+%2f%3e%0d%0a++++++++++%3cGridCell+Style%3d%22Class194%22+Merge%3d%22False%22+RowSpan%3d%22%22+ColSpan%3d%22%22+Format%3d%22General%22+Width%3d%2230%22+Text%3d%22%22+Height%3d%2215%22+Align%3d%22Center%22+CellHasFormula%3d%22False%22+FontName%3d%22Calibri%22+WrapText%3d%22False%22+FontSize%3d%229%22+X%3d%2222%22+Y%3d%2221%22+%2f%3e%0d%0a++++++++++%3cGridCell+Style%3d%22Class194%22+Merge%3d%22False%22+RowSpan%3d%22%22+ColSpan%3d%22%22+Format%3d%22General%22+Width%3d%2230%22+Text%3d%22%22+Height%3d%2215%22+Align%3d%22Center%22+CellHasFormula%3d%22False%22+FontName%3d%22Calibri%22+WrapText%3d%22False%22+FontSize%3d%229%22+X%3d%2223%22+Y%3d%2221%22+%2f%3e%0d%0a++++++++++%3cGridCell+Style%3d%22Class194%22+Merge%3d%22False%22+RowSpan%3d%22%22+ColSpan%3d%22%22+Format%3d%22General%22+Width%3d%2230%22+Text%3d%22%22+Height%3d%2215%22+Align%3d%22Center%22+CellHasFormula%3d%22False%22+FontName%3d%22Calibri%22+WrapText%3d%22False%22+FontSize%3d%229%22+X%3d%2224%22+Y%3d%2221%22+%2f%3e%0d%0a++++++++++%3cGridCell+Style%3d%22Class194%22+Merge%3d%22False%22+RowSpan%3d%22%22+ColSpan%3d%22%22+Format%3d%22General%22+Width%3d%2230%22+Text%3d%22%22+Height%3d%2215%22+Align%3d%22Center%22+CellHasFormula%3d%22False%22+FontName%3d%22Calibri%22+WrapText%3d%22False%22+FontSize%3d%229%22+X%3d%2225%22+Y%3d%2221%22+%2f%3e%0d%0a++++++++++%3cGridCell+Style%3d%22Class194%22+Merge%3d%22False%22+RowSpan%3d%22%22+ColSpan%3d%22%22+Format%3d%22General%22+Width%3d%2230%22+Text%3d%22%22+Height%3d%2215%22+Align%3d%22Center%22+CellHasFormula%3d%22False%22+FontName%3d%22Calibri%22+WrapText%3d%22False%22+FontSize%3d%229%22+X%3d%2226%22+Y%3d%2221%22+%2f%3e%0d%0a++++++++++%3cGridCell+Style%3d%22Class194%22+Merge%3d%22False%22+RowSpan%3d%22%22+ColSpan%3d%22%22+Format%3d%22General%22+Width%3d%2230%22+Text%3d%22%22+Height%3d%2215%22+Align%3d%22Center%22+CellHasFormula%3d%22False%22+FontName%3d%22Calibri%22+WrapText%3d%22False%22+FontSize%3d%229%22+X%3d%2227%22+Y%3d%2221%22+%2f%3e%0d%0a++++++++++%3cGridCell+Style%3d%22Class194%22+Merge%3d%22False%22+RowSpan%3d%22%22+ColSpan%3d%22%22+Format%3d%22General%22+Width%3d%2230%22+Text%3d%22%22+Height%3d%2215%22+Align%3d%22Center%22+CellHasFormula%3d%22False%22+FontName%3d%22Calibri%22+WrapText%3d%22False%22+FontSize%3d%229%22+X%3d%2228%22+Y%3d%2221%22+%2f%3e%0d%0a++++++++++%3cGridCell+Style%3d%22Class194%22+Merge%3d%22False%22+RowSpan%3d%22%22+ColSpan%3d%22%22+Format%3d%22General%22+Width%3d%2230%22+Text%3d%22%22+Height%3d%2215%22+Align%3d%22Center%22+CellHasFormula%3d%22False%22+FontName%3d%22Calibri%22+WrapText%3d%22False%22+FontSize%3d%229%22+X%3d%2229%22+Y%3d%2221%22+%2f%3e%0d%0a++++++++++%3cGridCell+Style%3d%22Class194%22+Merge%3d%22False%22+RowSpan%3d%22%22+ColSpan%3d%22%22+Format%3d%22General%22+Width%3d%2230%22+Text%3d%22%22+Height%3d%2215%22"}},{"$cut":{"chars":32761,"head":" 22%22+Height%3d%2215%22+Align%3d%22Center%22+CellHasFormula%3d%22False%22+FontName%3d%22Calibri%22+WrapText%3d%22False%22+FontSize%3d%229%22+X%3d%2228%22+Y%3d%2230%22+%2f%3e%0d%0a++++++++++%3cGridCell+Style%3d%22Class194%22+Merge%3d%22False%22+RowSpan%3d%22%22+ColSpan%3d%22%22+Format%3d%22General%22+Width%3d%2230%22+Text%3d%22%22+Height%3d%2215%22+Align%3d%22Center%22+CellHasFormula%3d%22False%22+FontName%3d%22Calibri%22+WrapText%3d%22False%22+FontSize%3d%229%22+X%3d%2229%22+Y%3d%2230%22+%2f%3e%0d%0a++++++++++%3cGridCell+Style%3d%22Class194%22+Merge%3d%22False%22+RowSpan%3d%22%22+ColSpan%3d%22%22+Format%3d%22General%22+Width%3d%2230%22+Text%3d%22%22+Height%3d%2215%22+Align%3d%22Center%22+CellHasFormula%3d%22False%22+FontName%3d%22Calibri%22+WrapText%3d%22False%22+FontSize%3d%229%22+X%3d%2230%22+Y%3d%2230%22+%2f%3e%0d%0a++++++++++%3cGridCell+Style%3d%22Class199%22+Merge%3d%22False%22+RowSpan%3d%22%22+ColSpan%3d%22%22+Format%3d%22General%22+Width%3d%2230%22+Text%3d%22%22+Height%3d%2215.75%22+Align%3d%22Center%22+CellHasFormula%3d%22False%22+FontName%3d%22Calibri%22+WrapText%3d%22False%22+FontSize%3d%229%22+X%3d%2221%22+Y%3d%2231%22+%2f%3e%0d%0a++++++++++%3cGridCell+Style%3d%22Class200%22+Merge%3d%22False%22+RowSpan%3d%22%22+ColSpan%3d%22%22+Format%3d%22General%22+Width%3d%2230%22+Text%3d%22%22+Height%3d%2215.75%22+Align%3d%22Center%22+CellHasFormula%3d%22False%22+FontName%3d%22Calibri%22+WrapText%3d%22False%22+FontSize%3d%229%22+X%3d%2222%22+Y%3d%2231%22+%2f%3e%0d%0a++++++++++%3cGridCell+Style%3d%22Class200%22+Merge%3d%22False%22+RowSpan%3d%22%22+ColSpan%3d%22%22+Format%3d%22General%22+Width%3d%2230%22+Text%3d%22%22+Height%3d%2215.75%22+Align%3d%22Center%22+CellHasFormula%3d%22False%22+FontName%3d%22Calibri%22+WrapText%3d%22False%22+FontSize%3d%229%22+X%3d%2223%22+Y%3d%2231%22+%2f%3e%0d%0a++++++++++%3cGridCell+Style%3d%22Class200%22+Merge%3d%22False%22+RowSpan%3d%22%22+ColSpan%3d%22%22+Format%3d%22General%22+Width%3d%2230%22+Text%3d%22%22+Height%3d%2215.75%22+Align%3d%22Center%22+CellHasFormula%3d%22False%22+FontName%3d%22Calibri%22+WrapText%3d%22False%22+FontSize%3d%229%22+X%3d%2224%22+Y%3d%2231%22+%2f%3e%0d%0a++++++++++%3cGridCell+Style%3d%22Class200%22+Merge%3d%22False%22+RowSpan%3d%22%22+ColSpan%3d%22%22+Format%3d%22General%22+Width%3d%2230%22+Text%3d%22%22+Height%3d%2215.75%22+Align%3d%22Center%22+CellHasFormula%3d%22False%22+FontName%3d%22Calibri%22+WrapText%3d%22False%22+FontSize%3d%229%22+X%3d%2225%22+Y%3d%2231%22+%2f%3e%0d%0a++++++++++%3cGridCell+Style%3d%22Class200%22+Merge%3d%22False%22+RowSpan%3d%22%22+ColSpan%3d%22%22+Format%3d%22General%22+Width%3d%2230%22+Text%3d%22%22+Height%3d%2215.75%22+Align%3d%22Center%22+CellHasFormula%3d%22False%22+FontName%3d%22Calibri%22+WrapText%3d%22False%22+FontSize%3d%229%22+X%3d%2226%22+Y%3d%2231%22+%2f%3e%0d%0a++++++++++%3cGridCell+Style%3d%22Class200%22+Merge%3d%22False%22+RowSpan%3d%22%22+ColSpan%3d%22%22+Format%3d%22General%22+Width%3d%2230%22+Text%3d%22%22+Height%3d%2215.75%22+Align%3d%22Center%22+CellHasFormula%3d%22False%22+FontName%3d%22Calibri%22+WrapText%3d%22False%22+FontSize%3d%229%22+X%3d%2227%22+Y%3d%2231%22+%2f%3e%0d%0a++++++++++%3cGridCell+Style%3d%22Class200%22+Merge%3d%22False%22+RowSpan%3d%22%22+ColSpan%3d%22%22+Format%3d%22General%22+Width%3d%2230%22+Text%3d%22%22+Height%3d%2215.75%22+Align%3d%22Center%22+CellHasFormula%3d%22False%22+FontName%3d%22Calibri%22+WrapText%3d%22False%22+FontSize%3d%229%22+X%3d%2228%22+Y%3d%2231%22+%2f%3e%0d%0a++++++++++%3cGridCell+Style%3d%22Class200%22+Merge%3d%22False%22+RowSpan%3d%22%22+ColSpan%3d%22%22+Format%3d%22General%22+Width%3d%2230%22+Text%3d%22%22+Height%3d%2215.75%22+Align%3d%22Center%22+CellHasFormula%3d%22False%22+FontName%3d%22Calibri%22+WrapText%3d%22False%22+FontSize%3d%229%22+X%3d%2229%22+Y%3d%2231%22+%2f%3e%0d%0a++++++++++%3cGridCell+Style%3d%22Class200%22+Merge%3d%22False%22+RowSpan%3d%22%22+ColSpan%3d%22%22+Format%3d%22General%22+Width%3d%2230%22+Text%3d%22%22+Height%3d%2215.75%22+Align%3d%22Center%22+CellHasFormula%3d%22False%22+FontName%3d%22Calibri%22+WrapText%3d%22False%22+FontSize%3d%229%22+X%3d%2230%22"}},{"$cut":{"chars":32761,"head":" ntSize%3d%229%22+X%3d%2220%22+Y%3d%2216%22+%2f%3e%0d%0a++++++%3cTD+Style%3d%22Class195%22+Merge%3d%22False%22+RowSpan%3d%22%22+ColSpan%3d%22%22+Format%3d%220.00%22+Width%3d%2230%22+Text%3d%22%22+Height%3d%2215%22+Align%3d%22Center%22+CellHasFormula%3d%22True%22+FontName%3d%22Calibri%22+WrapText%3d%22False%22+FontSize%3d%229%22+X%3d%2231%22+Y%3d%2216%22+%2f%3e%0d%0a++++++%3cTD+Style%3d%22Class191%22+Merge%3d%22True%22+RowSpan%3d%22%22+ColSpan%3d%222%22+Format%3d%220.00%22+Width%3d%2249.5%22+Text%3d%22%22+Height%3d%2215%22+Align%3d%22Center%22+CellHasFormula%3d%22True%22+FontName%3d%22Calibri%22+WrapText%3d%22False%22+FontSize%3d%229%22+X%3d%2232%22+Y%3d%2216%22+%2f%3e%0d%0a++++++%3cTD+Style%3d%22Class196%22+Merge%3d%22True%22+RowSpan%3d%22%22+ColSpan%3d%222%22+Format%3d%22General%22+Width%3d%2249.5%22+Text%3d%22%22+Height%3d%2215%22+Align%3d%22Center%22+CellHasFormula%3d%22True%22+FontName%3d%22Calibri%22+WrapText%3d%22False%22+FontSize%3d%229%22+X%3d%2234%22+Y%3d%2216%22+%2f%3e%0d%0a++++++%3cTD+Style%3d%22Class181%22+Merge%3d%22False%22+RowSpan%3d%22%22+ColSpan%3d%22%22+Format%3d%22General%22+Width%3d%2224.75%22+Text%3d%22%22+Height%3d%2215%22+Align%3d%22Left%22+CellHasFormula%3d%22False%22+FontName%3d%22Calibri%22+WrapText%3d%22False%22+FontSize%3d%2211%22+X%3d%2236%22+Y%3d%2216%22+%2f%3e%0d%0a++++%3c%2fTR%3e%0d%0a++++%3cTR%3e%0d%0a++++++%3cTD+Style%3d%22Class179%22+Merge%3d%22False%22+RowSpan%3d%22%22+ColSpan%3d%22%22+Format%3d%22General%22+Width%3d%2224.75%22+Text%3d%22%22+Height%3d%2215%22+Align%3d%22Left%22+CellHasFormula%3d%22False%22+FontName%3d%22Calibri%22+WrapText%3d%22False%22+FontSize%3d%2211%22+X%3d%221%22+Y%3d%2217%22+%2f%3e%0d%0a++++++%3cTD+Style%3d%22Class191%22+Merge%3d%22False%22+RowSpan%3d%22%22+ColSpan%3d%22%22+Format%3d%22General%22+Width%3d%2230.75%22+Text%3d%22%22+Height%3d%2215%22+Align%3d%22Center%22+CellHasFormula%3d%22True%22+FontName%3d%22Calibri%22+WrapText%3d%22False%22+FontSize%3d%229%22+X%3d%222%22+Y%3d%2217%22+%2f%3e%0d%0a++++++%3cTD+Style%3d%22Class192%22+Merge%3d%22True%22+RowSpan%3d%22%22+ColSpan%3d%224%22+Format%3d%22General%22+Width%3d%2299%22+Text%3d%22%22+Height%3d%2215%22+Align%3d%22Left%22+CellHasFormula%3d%22True%22+FontName%3d%22Calibri%22+WrapText%3d%22False%22+FontSize%3d%229%22+X%3d%223%22+Y%3d%2217%22+%2f%3e%0d%0a++++++%3cTD+Style%3d%22Class195%22+Merge%3d%22False%22+RowSpan%3d%22%22+ColSpan%3d%22%22+Format%3d%220.00%22+Width%3d%2230%22+Text%3d%22%22+Height%3d%2215%22+Align%3d%22Center%22+CellHasFormula%3d%22True%22+FontName%3d%22Calibri%22+WrapText%3d%22False%22+FontSize%3d%229%22+X%3d%2213%22+Y%3d%2217%22+%2f%3e%0d%0a++++++%3cTD+Style%3d%22Class195%22+Merge%3d%22False%22+RowSpan%3d%22%22+ColSpan%3d%22%22+Format%3d%220.00%22+Width%3d%2230%22+Text%3d%22%22+Height%3d%2215%22+Align%3d%22Center%22+CellHasFormula%3d%22True%22+FontName%3d%22Calibri%22+WrapText%3d%22False%22+FontSize%3d%229%22+X%3d%2216%22+Y%3d%2217%22+%2f%3e%0d%0a++++++%3cTD+Style%3d%22Class195%22+Merge%3d%22False%22+RowSpan%3d%22%22+ColSpan%3d%22%22+Format%3d%220.00%22+Width%3d%2230%22+Text%3d%22%22+Height%3d%2215%22+Align%3d%22Center%22+CellHasFormula%3d%22True%22+FontName%3d%22Calibri%22+WrapText%3d%22False%22+FontSize%3d%229%22+X%3d%2220%22+Y%3d%2217%22+%2f%3e%0d%0a++++++%3cTD+Style%3d%22Class195%22+Merge%3d%22False%22+RowSpan%3d%22%22+ColSpan%3d%22%22+Format%3d%220.00%22+Width%3d%2230%22+Text%3d%22%22+Height%3d%2215%22+Align%3d%22Center%22+CellHasFormula%3d%22True%22+FontName%3d%22Calibri%22+WrapText%3d%22False%22+FontSize%3d%229%22+X%3d%2231%22+Y%3d%2217%22+%2f%3e%0d%0a++++++%3cTD+Style%3d%22Class191%22+Merge%3d%22True%22+RowSpan%3d%22%22+ColSpan%3d%222%22+Format%3d%220.00%22+Width%3d%2249.5%22+Text%3d%22%22+Height%3d%2215%22+Align%3d%22Center%22+CellHasFormula%3d%22True%22+FontName%3d%22Calibri%22+WrapText%3d%22False%22+FontSize%3d%229%22+X%3d%2232%22+Y%3d%2217%22+%2f%3e%0d%0a++++++%3cTD+Style%3d%22Class196%22+Merge%3d%22True%22+RowSpan%3d%22%22+ColSpan%3d%222%22+Format%3d%22General%22+Width%3d%2249.5%22+Text%3d%22%22+Height%3d%2215%22+Align%3d%22Center%22+CellHasFormula%3d%22True%22+FontName%3d%22Calibr"}},{"$cut":{"chars":32761,"head":" +FontSize%3d%229%22+X%3d%2234%22+Y%3d%2226%22+%2f%3e%0d%0a++++++%3cTD+Style%3d%22Class181%22+Merge%3d%22False%22+RowSpan%3d%22%22+ColSpan%3d%22%22+Format%3d%22General%22+Width%3d%2224.75%22+Text%3d%22%22+Height%3d%2215%22+Align%3d%22Left%22+CellHasFormula%3d%22False%22+FontName%3d%22Calibri%22+WrapText%3d%22False%22+FontSize%3d%2211%22+X%3d%2236%22+Y%3d%2226%22+%2f%3e%0d%0a++++%3c%2fTR%3e%0d%0a++++%3cTR%3e%0d%0a++++++%3cTD+Style%3d%22Class179%22+Merge%3d%22False%22+RowSpan%3d%22%22+ColSpan%3d%22%22+Format%3d%22General%22+Width%3d%2224.75%22+Text%3d%22%22+Height%3d%2215%22+Align%3d%22Left%22+CellHasFormula%3d%22False%22+FontName%3d%22Calibri%22+WrapText%3d%22False%22+FontSize%3d%2211%22+X%3d%221%22+Y%3d%2227%22+%2f%3e%0d%0a++++++%3cTD+Style%3d%22Class191%22+Merge%3d%22False%22+RowSpan%3d%22%22+ColSpan%3d%22%22+Format%3d%22General%22+Width%3d%2230.75%22+Text%3d%22%22+Height%3d%2215%22+Align%3d%22Center%22+CellHasFormula%3d%22True%22+FontName%3d%22Calibri%22+WrapText%3d%22False%22+FontSize%3d%229%22+X%3d%222%22+Y%3d%2227%22+%2f%3e%0d%0a++++++%3cTD+Style%3d%22Class192%22+Merge%3d%22True%22+RowSpan%3d%22%22+ColSpan%3d%224%22+Format%3d%22General%22+Width%3d%2299%22+Text%3d%22%22+Height%3d%2215%22+Align%3d%22Left%22+CellHasFormula%3d%22True%22+FontName%3d%22Calibri%22+WrapText%3d%22False%22+FontSize%3d%229%22+X%3d%223%22+Y%3d%2227%22+%2f%3e%0d%0a++++++%3cTD+Style%3d%22Class195%22+Merge%3d%22False%22+RowSpan%3d%22%22+ColSpan%3d%22%22+Format%3d%220.00%22+Width%3d%2230%22+Text%3d%22%22+Height%3d%2215%22+Align%3d%22Center%22+CellHasFormula%3d%22True%22+FontName%3d%22Calibri%22+WrapText%3d%22False%22+FontSize%3d%229%22+X%3d%2213%22+Y%3d%2227%22+%2f%3e%0d%0a++++++%3cTD+Style%3d%22Class195%22+Merge%3d%22False%22+RowSpan%3d%22%22+ColSpan%3d%22%22+Format%3d%220.00%22+Width%3d%2230%22+Text%3d%22%22+Height%3d%2215%22+Align%3d%22Center%22+CellHasFormula%3d%22True%22+FontName%3d%22Calibri%22+WrapText%3d%22False%22+FontSize%3d%229%22+X%3d%2216%22+Y%3d%2227%22+%2f%3e%0d%0a++++++%3cTD+Style%3d%22Class195%22+Merge%3d%22False%22+RowSpan%3d%22%22+ColSpan%3d%22%22+Format%3d%220.00%22+Width%3d%2230%22+Text%3d%22%22+Height%3d%2215%22+Align%3d%22Center%22+CellHasFormula%3d%22True%22+FontName%3d%22Calibri%22+WrapText%3d%22False%22+FontSize%3d%229%22+X%3d%2220%22+Y%3d%2227%22+%2f%3e%0d%0a++++++%3cTD+Style%3d%22Class195%22+Merge%3d%22False%22+RowSpan%3d%22%22+ColSpan%3d%22%22+Format%3d%220.00%22+Width%3d%2230%22+Text%3d%22%22+Height%3d%2215%22+Align%3d%22Center%22+CellHasFormula%3d%22True%22+FontName%3d%22Calibri%22+WrapText%3d%22False%22+FontSize%3d%229%22+X%3d%2231%22+Y%3d%2227%22+%2f%3e%0d%0a++++++%3cTD+Style%3d%22Class191%22+Merge%3d%22True%22+RowSpan%3d%22%22+ColSpan%3d%222%22+Format%3d%220.00%22+Width%3d%2249.5%22+Text%3d%22%22+Height%3d%2215%22+Align%3d%22Center%22+CellHasFormula%3d%22True%22+FontName%3d%22Calibri%22+WrapText%3d%22False%22+FontSize%3d%229%22+X%3d%2232%22+Y%3d%2227%22+%2f%3e%0d%0a++++++%3cTD+Style%3d%22Class196%22+Merge%3d%22True%22+RowSpan%3d%22%22+ColSpan%3d%222%22+Format%3d%22General%22+Width%3d%2249.5%22+Text%3d%22%22+Height%3d%2215%22+Align%3d%22Center%22+CellHasFormula%3d%22True%22+FontName%3d%22Calibri%22+WrapText%3d%22False%22+FontSize%3d%229%22+X%3d%2234%22+Y%3d%2227%22+%2f%3e%0d%0a++++++%3cTD+Style%3d%22Class181%22+Merge%3d%22False%22+RowSpan%3d%22%22+ColSpan%3d%22%22+Format%3d%22General%22+Width%3d%2224.75%22+Text%3d%22%22+Height%3d%2215%22+Align%3d%22Left%22+CellHasFormula%3d%22False%22+FontName%3d%22Calibri%22+WrapText%3d%22False%22+FontSize%3d%2211%22+X%3d%2236%22+Y%3d%2227%22+%2f%3e%0d%0a++++%3c%2fTR%3e%0d%0a++++%3cTR%3e%0d%0a++++++%3cTD+Style%3d%22Class179%22+Merge%3d%22False%22+RowSpan%3d%22%22+ColSpan%3d%22%22+Format%3d%22General%22+Width%3d%2224.75%22+Text%3d%22%22+Height%3d%2215%22+Align%3d%22Left%22+CellHasFormula%3d%22False%22+FontName%3d%22Calibri%22+WrapText%3d%22False%22+FontSize%3d%2211%22+X%3d%221%22+Y%3d%2228%22+%2f%3e%0d%0a++++++%3cTD+Style%3d%22Class191%22+Merge%3d%22False%22+RowSpan%3d%22%22+ColSpan%3d%22%22+Format%3d%22General%22+Width%3d%2230.75%22+Text%3d%22%22+Height%3d%2215%22+Align%3d%22Center"}}," +X%3d%2222%22+Y%3d%2233%22+%2f%3e%0d%0a++++++%3cTD+Style%3d%22Class208%22+Merge%3d%22False%22+RowSpan%3d%22%22+ColSpan%3d%22%22+Format%3d%22General%22+Width%3d%2230%22+Text%3d%22%22+Height%3d%2215%22+Align%3d%22Left%22+CellHasFormula%3d%22False%22+FontName%3d%22Calibri%22+WrapText%3d%22False%22+FontSize%3d%229%22+X%3d%2223%22+Y%3d%2233%22+%2f%3e%0d%0a++++++%3cTD+Style%3d%22Class208%22+Merge%3d%22False%22+RowSpan%3d%22%22+ColSpan%3d%22%22+Format%3d%22General%22+Width%3d%2230%22+Text%3d%22%22+Height%3d%2215%22+Align%3d%22Left%22+CellHasFormula%3d%22False%22+FontName%3d%22Calibri%22+WrapText%3d%22False%22+FontSize%3d%229%22+X%3d%2224%22+Y%3d%2233%22+%2f%3e%0d%0a++++++%3cTD+Style%3d%22Class208%22+Merge%3d%22False%22+RowSpan%3d%22%22+ColSpan%3d%22%22+Format%3d%22General%22+Width%3d%2230%22+Text%3d%22%22+Height%3d%2215%22+Align%3d%22Left%22+CellHasFormula%3d%22False%22+FontName%3d%22Calibri%22+WrapText%3d%22False%22+FontSize%3d%229%22+X%3d%2225%22+Y%3d%2233%22+%2f%3e%0d%0a++++++%3cTD+Style%3d%22Class208%22+Merge%3d%22False%22+RowSpan%3d%22%22+ColSpan%3d%22%22+Format%3d%22General%22+Width%3d%2230%22+Text%3d%22%22+Height%3d%2215%22+Align%3d%22Left%22+CellHasFormula%3d%22False%22+FontName%3d%22Calibri%22+WrapText%3d%22False%22+FontSize%3d%229%22+X%3d%2226%22+Y%3d%2233%22+%2f%3e%0d%0a++++++%3cTD+Style%3d%22Class208%22+Merge%3d%22False%22+RowSpan%3d%22%22+ColSpan%3d%22%22+Format%3d%22General%22+Width%3d%2230%22+Text%3d%22%22+Height%3d%2215%22+Align%3d%22Left%22+CellHasFormula%3d%22False%22+FontName%3d%22Calibri%22+WrapText%3d%22False%22+FontSize%3d%229%22+X%3d%2227%22+Y%3d%2233%22+%2f%3e%0d%0a++++++%3cTD+Style%3d%22Class208%22+Merge%3d%22False%22+RowSpan%3d%22%22+ColSpan%3d%22%22+Format%3d%22General%22+Width%3d%2230%22+Text%3d%22%22+Height%3d%2215%22+Align%3d%22Left%22+CellHasFormula%3d%22False%22+FontName%3d%22Calibri%22+WrapText%3d%22False%22+FontSize%3d%229%22+X%3d%2228%22+Y%3d%2233%22+%2f%3e%0d%0a++++++%3cTD+Style%3d%22Class208%22+Merge%3d%22False%22+RowSpan%3d%22%22+ColSpan%3d%22%22+Format%3d%22General%22+Width%3d%2230%22+Text%3d%22%22+Height%3d%2215%22+Align%3d%22Left%22+CellHasFormula%3d%22False%22+FontName%3d%22Calibri%22+WrapText%3d%22False%22+FontSize%3d%229%22+X%3d%2229%22+Y%3d%2233%22+%2f%3e%0d%0a++++++%3cTD+Style%3d%22Class208%22+Merge%3d%22False%22+RowSpan%3d%22%22+ColSpan%3d%22%22+Format%3d%22General%22+Width%3d%2230%22+Text%3d%22%22+Height%3d%2215%22+Align%3d%22Left%22+CellHasFormula%3d%22False%22+FontName%3d%22Calibri%22+WrapText%3d%22False%22+FontSize%3d%229%22+X%3d%2230%22+Y%3d%2233%22+%2f%3e%0d%0a++++++%3cTD+Style%3d%22Class208%22+Merge%3d%22False%22+RowSpan%3d%22%22+ColSpan%3d%22%22+Format%3d%22General%22+Width%3d%2230%22+Text%3d%22%22+Height%3d%2215%22+Align%3d%22Left%22+CellHasFormula%3d%22False%22+FontName%3d%22Calibri%22+WrapText%3d%22False%22+FontSize%3d%229%22+X%3d%2231%22+Y%3d%2233%22+%2f%3e%0d%0a++++++%3cTD+Style%3d%22Class209%22+Merge%3d%22True%22+RowSpan%3d%22%22+ColSpan%3d%222%22+Format%3d%220.00%22+Width%3d%2249.5%22+Text%3d%22%22+Height%3d%2215%22+Align%3d%22Right%22+CellHasFormula%3d%22False%22+FontName%3d%22Calibri%22+WrapText%3d%22False%22+FontSize%3d%2211%22+X%3d%2232%22+Y%3d%2233%22+%2f%3e%0d%0a++++++%3cTD+Style%3d%22Class210%22+Merge%3d%22False%22+RowSpan%3d%22%22+ColSpan%3d%22%22+Format%3d%22General%22+Width%3d%2224.75%22+Text%3d%22%22+Height%3d%2215%22+Align%3d%22Left%22+CellHasFormula%3d%22False%22+FontName%3d%22Calibri%22+WrapText%3d%22False%22+FontSize%3d%2211%22+X%3d%2234%22+Y%3d%2233%22+%2f%3e%0d%0a++++++%3cTD+Style%3d%22Class210%22+Merge%3d%22False%22+RowSpan%3d%22%22+ColSpan%3d%22%22+Format%3d%22General%22+Width%3d%2224.75%22+Text%3d%22%22+Height%3d%2215%22+Align%3d%22Left%22+CellHasFormula%3d%22False%22+FontName%3d%22Calibri%22+WrapText%3d%22False%22+FontSize%3d%2211%22+X%3d%2235%22+Y%3d%2233%22+%2f%3e%0d%0a++++++%3cTD+Style%3d%22Class176%22+Merge%3d%22False%22+RowSpan%3d%22%22+ColSpan%3d%22%22+Format%3d%22General%22+Width%3d%2224.75%22+Text%3d%22%22+Height%3d%2215%22+Align%3d%22Left%22+CellHasFormula%3d%22False%22+FontName%3d%22Calibri%22+WrapText%3d%22False%22+FontSize%3d%2211%22+X%3d%2236%22+Y%3d%2233%22+%2f%3e%0d%0a++++%3c%2fTR%3e%0d%0a++%3c%2fTable%3e%0d%0a%3c%2fTables%3e"]
["%3c%3fxml+version%3d%221.0%22+encoding%3d%22utf-16%22%3f%3e%0d%0a%3cPageLayouts+xmlns%3axsi%3d%22http%3a%2f%2fwww.w3.org%2f2001%2fXMLSchema-instance%22+xmlns%3axsd%3d%22http%3a%2f%2fwww.w3.org%2f2001%2fXMLSchema%22+IsTabsVisible%3d%22true%22+InitialPageIndex%3d%220%22%3e%0d%0a++%3cPageLayout+Index%3d%220%22+IsPageHidingEnabled%3d%22false%22+Order%3d%220%22+FileName%3d%221.+Grade+Sheet%22+IsAjaxEnabled%3d%22true%22+Recipient%3d%22Enter+e-mail+address+here.%22+Location%3d%22Bottom%22+Alignment%3d%22Center%22+AutoResponseEmail%3d%22False%22+NotificationEmail%3d%22False%22+PageForwarding%3d%22False%22+PageForwardingCustomPage%3d%22False%22+PageForwardingIsExternalURL%3d%22False%22+PageForwardingExternalURL%3d%22None%22%3e%0d%0a++++%3cControls%3e%0d%0a++++++%3cPageControl+Enabled%3d%22false%22+Type%3d%22Calculate%22+Order%3d%220%22+CellLink%3d%22DEFAULT%22+Name%3d%22Calculate%22+%2f%3e%0d%0a++++++%3cPageControl+Enabled%3d%22false%22+Type%3d%22Reset%22+Order%3d%221%22+CellLink%3d%22DEFAULT%22+Name%3d%22Reset%22+%2f%3e%0d%0a++++++%3cPageControl+Enabled%3d%22false%22+Type%3d%22Send+Results%22+Order%3d%222%22+CellLink%3d%22DEFAULT%22+Name%3d%22Submit%22+%2f%3e%0d%0a++++++%3cPageControl+Enabled%3d%22false%22+Type%3d%22Save%22+Order%3d%223%22+CellLink%3d%22DEFAULT%22+Name%3d%22Save%22+%2f%3e%0d%0a++++++%3cPageControl+Enabled%3d%22false%22+Type%3d%22Back%22+Order%3d%225%22+CellLink%3d%22DEFAULT%22+Name%3d%22Back%22+%2f%3e%0d%0a++++++%3cPageControl+Enabled%3d%22false%22+Type%3d%22Next%22+Order%3d%224%22+CellLink%3d%22DEFAULT%22+Name%3d%22Next%22+%2f%3e%0d%0a++++%3c%2fControls%3e%0d%0a++%3c%2fPageLayout%3e%0d%0a++%3cApplicationName%3eTeacher+Grade+Sheet+(Online)2%3c%2fApplicationName%3e%0d%0a%3c%2fPageLayouts%3e"]
["\n.Class176{font-family: Calibri; font-size:11pt; color:Black;border: 0.5pt  None  Black ;background-color:White; text-align:left;vertical-align:bottom;}\n.Class177{font-family: Calibri; font-size:11pt; color:#254061;font-weight: bold;border: 0.5pt  None  Black ;background-color:White; text-align:left;vertical-align:middle;}\n.Class178{font-family: Calibri; font-size:11pt; color:Black;border-bottom-style: Solid ;border-top-width: 0.5pt ;border-left-width: 0.5pt ;border-right-width: 0.5pt ;border-bottom-width: 1.0pt ;border-color: Black ;background-color:White; text-align:left;vertical-align:bottom;}\n.Class179{font-family: Calibri; font-size:11pt; color:Black;border-right-style: Solid ;border-top-width: 0.5pt ;border-left-width: 0.5pt ;border-right-width: 1.0pt ;border-bottom-width: 0.5pt ;border-color: Black ;background-color:White; text-align:left;vertical-align:bottom;}\n.Class180{font-family: Calibri; font-size:9pt; color:Black;font-weight: bold;border-top-style: Solid ;border-left-style: Solid ;border-bottom-style: Solid ;border-top-width: 1.0pt ;border-left-width: 1.0pt ;border-right-width: 0.5pt ;border-bottom-width: 0.5pt ;border-color: Black ;background-color:#DBE5F1; text-align:center;vertical-align:bottom;}\n.Class181{font-family: Calibri; font-size:11pt; color:Black;border-left-style: Solid ;border-top-width: 0.5pt ;border-left-width: 1.0pt ;border-right-width: 0.5pt ;border-bottom-width: 0.5pt ;border-color: Black ;background-color:White; text-align:left;vertical-align:bottom;}\n.Class182{font-family: Calibri; font-size:9pt; color:Black;font-weight: bold;border-style: Solid ;border-top-width: 0.5pt ;border-left-width: 1.0pt ;border-right-width: 0.5pt ;border-bottom-width: 1.0pt ;border-top-color: Black ;border-left-color: Black ;border-right-color: #948B54 ;border-bottom-color: Black ;background-color:#DBE5F1; text-align:center;vertical-align:bottom;}\n.Class183{font-family: Calibri; font-size:9pt; color:Black;font-weight: bold;border-style: Solid ;border-top-width: 0.5pt ;border-left-width: 0.5pt ;border-right-width: 0.5pt ;border-bottom-width: 1.0pt ;border-top-color: Black ;border-left-color: #948B54 ;border-right-color: #948B54 ;border-bottom-color: Black ;background-color:#DBE5F1; text-align:center;vertical-align:bottom;}\n.Class184{font-family: Calibri; font-size:9pt; color:Black;font-weight: bold;border-style: Solid ;border-top-width: 0.5pt ;border-left-width: 0.5pt ;border-right-width: 1.0pt ;border-bottom-width: 1.0pt ;border-top-color: Black ;border-left-color: #948B54 ;border-right-color: Black ;border-bottom-color: Black ;background-color:#DBE5F1; text-align:center;vertical-align:bottom;}\n.Class185{font-family: Calibri; font-size:9pt; color:Black;border-style: Solid ;border-top-width: 1.0pt ;border-left-width: 1.0pt ;border-right-width: 0.5pt ;border-bottom-width: 0.5pt ;border-top-color: Black ;border-left-color: Black ;border-right-color: #948B54 ;border-bottom-color: #948B54 ;background-color:#DBE5F1; text-align:center;vertical-align:bottom;}\n.Class186{font-family: Calibri; font-size:9pt; color:Black;border-style: Solid ;border-top-width: 1.0pt ;border-left-width: 0.5pt ;border-right-width: 0.5pt ;border-bottom-width: 0.5pt ;border-top-color: Black ;border-left-color: #948B54 ;border-right-color: #948B54 ;border-bottom-color: #948B54 ;background-color:#DBE5F1; text-align:left;vertical-align:bottom;}\n.Class187{font-family: Calibri; font-size:9pt; color:Black;border-style: Solid ;border-top-width: 1.0pt ;border-left-width: 1.0pt ;border-right-width: 0.5pt ;border-bottom-width: 0.5pt ;border-top-color: Black ;border-left-color: Black ;border-right-color: #948B54 ;border-bottom-color: #948B54 ;background-color:White; text-align:center;vertical-align:bottom;}\n.Class188{font-family: Calibri; font-size:9pt; color:Black;border-style: Solid ;border-top-width: 1.0pt ;border-left-width: 0.5pt ;border-right-width: 0.5pt ;border-bottom-width: 0.5pt ;border-top-color: Black ;border-left-color: #948B54 ;border-right-color: #948B54 ;border-bottom-color: #948B54 ;background-color:White; text-align:center;vertical-align:bottom;}\n.Class189{font-family: Calibri; font-size:9pt; color:Black;border-style: Solid ;border-top-width: 1.0pt ;border-left-width: 0.5pt ;border-right-width: 1.0pt ;border-bottom-width: 0.5pt ;border-top-color: Black ;border-left-color: #948B54 ;border-right-color: Black ;border-bottom-color: #948B54 ;background-color:#EEECE1; text-align:center;vertical-align:bottom;}\n.Class190{font-family: Calibri; font-size:9pt; color:Black;border-style: Solid ;border-top-width: 1.0pt ;border-left-width: 0.5pt ;border-right-width: 0.5pt ;border-bottom-width: 0.5pt ;border-top-color: Black ;border-left-color: #948B54 ;border-right-color: #948B54 ;border-bottom-color: #948B54 ;background-color:#DBE5F1; text-align:center;vertical-align:bottom;}\n.Class191{font-family: Calibri; font-size:9pt; color:Black;border-style: Solid ;border-top-width: 0.5pt ;border-left-width: 1.0pt ;border-right-width: 0.5pt ;border-bottom-width: 0.5pt ;border-top-color: #948B54 ;border-left-color: Black ;border-right-color: #948B54 ;border-bottom-color: #948B54 ;background-color:#DBE5F1; text-align:center;vertical-align:bottom;}\n.Class192{font-family: Calibri; font-size:9pt; color:Black;border: 0.5pt  Solid  #948B54 ;background-color:#DBE5F1; text-align:left;vertical-align:bottom;}\n.Class193{font-family: Calibri; font-size:9pt; color:Black;border-style: Solid ;border-top-width: 0.5pt ;border-left-width: 1.0pt ;border-right-width: 0.5pt ;border-bottom-width: 0.5pt ;border-top-color: #948B54 ;border-left-color: Black ;border-right-color: #948B54 ;border-bottom-color: #948B54 ;background-color:White; text-align:center;vertical-align:bottom;}\n.Class194{font-family: Calibri; font-size:9pt; color:Black;border: 0.5pt  Solid  #948B54 ;background-color:White; text-align:center;vertical-align:bottom;}\n.Class195{font-family: Calibri; font-size:9pt; color:Black;border-style: Solid ;border-top-width: 0.5pt ;border-left-width: 0.5pt ;border-right-width: 1.0pt ;border-bottom-width: 0.5pt ;border-top-color: #948B54 ;border-left-color: #948B54 ;border-right-color: Black ;border-bottom-color: #948B54 ;background-color:#EEECE1; text-align:center;vertical-align:bottom;}\n.Class196{font-family: Calibri; font-size:9pt; color:Black;border: 0.5pt  Solid  #948B54 ;background-color:#DBE5F1; text-align:center;vertical-align:bottom;}\n.Class197{font-family: Calibri; font-size:9pt; color:Black;border-style: Solid ;border-top-width: 0.5pt ;border-left-width: 1.0pt ;border-right-width: 0.5pt ;border-bottom-width: 1.0pt ;border-top-color: #948B54 ;border-left-color: Black ;border-right-color: #948B54 ;border-bottom-color: Black ;background-color:#DBE5F1; text-align:center;vertical-align:bottom;}\n.Class198{font-family: Calibri; font-size:9pt; color:Black;border-style: Solid ;border-top-width: 0.5pt ;border-left-width: 0.5pt ;border-right-width: 0.5pt ;border-bottom-width: 1.0pt ;border-top-color: #948B54 ;border-left-color: #948B54 ;border-right-color: #948B54 ;border-bottom-color: Black ;background-color:#DBE5F1; text-align:left;vertical-align:bottom;}\n.Class199{font-family: Calibri; font-size:9pt; color:Black;border-style: Solid ;border-top-width: 0.5pt ;border-left-width: 1.0pt ;border-right-width: 0.5pt ;border-bottom-width: 1.0pt ;border-top-color: #948B54 ;border-left-color: Black ;border-right-color: #948B54 ;border-bottom-color: Black ;background-color:White; text-align:center;vertical-align:bottom;}\n.Class200{font-family: Calibri; font-size:9pt; color:Black;border-style: Solid ;border-top-width: 0.5pt ;border-left-width: 0.5pt ;border-right-width: 0.5pt ;border-bottom-width: 1.0pt ;border-top-color: #948B54 ;border-left-color: #948B54 ;border-right-color: #948B54 ;border-bottom-color: Black ;background-color:White; text-align:center;vertical-align:bottom;}\n.Class201{font-family: Calibri; font-size:9pt; color:Black;border-style: Solid ;border-top-width: 0.5pt ;border-left-width: 0.5pt ;border-right-width: 1.0pt ;border-bottom-width: 1.0pt ;border-top-color: #948B54 ;border-left-color: #948B54 ;border-right-color: Black ;border-bottom-color: Black ;background-color:#EEECE1; text-align:center;vertical-align:bottom;}\n.Class202{font-family: Calibri; font-size:9pt; color:Black;border-style: Solid ;border-top-width: 0.5pt ;border-left-width: 0.5pt ;border-right-width: 0.5pt ;border-bottom-width: 1.0pt ;border-top-color: #948B54 ;border-left-color: #948B54 ;border-right-color: #948B54 ;border-bottom-color: Black ;background-color:#DBE5F1; text-align:center;vertical-align:bottom;}\n.Class203{font-family: Calibri; font-size:9pt; color:Black;font-weight: bold;border-top-style: Solid ;border-left-style: Solid ;border-bottom-style: Solid ;border-top-width: 1.0pt ;border-left-width: 1.0pt ;border-right-width: 0.5pt ;border-bottom-width: 1.0pt ;border-color: Black ;background-color:#DBE5F1; text-align:left;vertical-align:bottom;}\n.Class204{font-family: Calibri; font-size:9pt; color:Black;border-style: Solid ;border-top-width: 1.0pt ;border-left-width: 1.0pt ;border-right-width: 0.5pt ;border-bottom-width: 1.0pt ;border-top-color: Black ;border-left-color: Black ;border-right-color: #948B54 ;border-bottom-color: Black ;background-color:#DBE5F1; text-align:center;vertical-align:bottom;}\n.Class205{font-family: Calibri; font-size:9pt; color:Black;border-style: Solid ;border-top-width: 1.0pt ;border-left-width: 0.5pt ;border-right-width: 0.5pt ;border-bottom-width: 1.0pt ;border-top-color: Black ;border-left-color: #948B54 ;border-right-color: #948B54 ;border-bottom-color: Black ;background-color:#DBE5F1; text-align:center;vertical-align:bottom;}\n.Class206{font-family: Calibri; font-size:9pt; color:Black;border-style: Solid ;border-top-width: 1.0pt ;border-left-width: 0.5pt ;border-right-width: 1.0pt ;border-bottom-width: 1.0pt ;border-top-color: Black ;border-left-color: #948B54 ;border-right-color: Black ;border-bottom-color: Black ;background-color:#DBE5F1; text-align:center;vertical-align:bottom;}\n.Class207{font-family: Calibri; font-size:9pt; color:Black;border-top-style: Solid ;border-left-style: Solid ;border-bottom-style: Solid ;border-top-width: 1.0pt ;border-left-width: 0.5pt ;border-right-width: 0.5pt ;border-bottom-width: 1.0pt ;border-top-color: Black ;border-left-color: #948B54 ;border-right-color: Black ;border-bottom-color: Black ;background-color:#DBE5F1; text-align:center;vertical-align:bottom;}\n.Class208{font-family: Calibri; font-size:9pt; color:Black;border-top-style: Solid ;border-top-width: 1.0pt ;border-left-width: 0.5pt ;border-right-width: 0.5pt ;border-bottom-width: 0.5pt ;border-color: Black ;background-color:White; text-align:left;vertical-align:bottom;}\n.Class209{font-family: Calibri; font-size:11pt; color:Black;border-top-style: Solid ;border-top-width: 1.0pt ;border-left-width: 0.5pt ;border-right-width: 0.5pt ;border-bottom-width: 0.5pt ;border-color: Black ;background-color:White; text-align:right;vertical-align:bottom;}\n.Class210{font-family: Calibri; font-size:11pt; color:Black;border-top-style: Solid ;border-top-width: 1.0pt ;border-left-width: 0.5pt ;border-right-width: 0.5pt ;border-bottom-width: 0.5pt ;border-color: Black ;background-color:White; text-align:left;vertical-align:bottom;}"]
["tr-TR"]
["2.0.0.0"]
[]
["UEsFBgAAAAAAAAAAAAAAAAAAAAAAAA%3d%3d"]
[]
[]
["%3c%3fxml+version%3d%221.0%22+encoding%3d%22utf-16%22%3f%3e%0d%0a%3cSavingCells+xmlns%3axsi%3d%22http%3a%2f%2fwww.w3.org%2f2001%2fXMLSchema-instance%22+xmlns%3axsd%3d%22http%3a%2f%2fwww.w3.org%2f2001%2fXMLSchema%22+CellCount%3d%2225%22+SavingCellPrefix%3d%22PSWSavingCell_%22%3e%0d%0a++%3cCells%3e%0d%0a++++%3cNameIndex%3e0%3c%2fNameIndex%3e%0d%0a++++%3cLabel%3eMT_Avg_1%3c%2fLabel%3e%0d%0a++++%3cValueType%3eNumeric%3c%2fValueType%3e%0d%0a++++%3cMultiRecordIndex+%2f%3e%0d%0a++%3c%2fCells%3e%0d%0a++%3cCells%3e%0d%0a++++%3cNameIndex%3e0%3c%2fNameIndex%3e%0d%0a++++%3cLabel%3eMT_Avg_2%3c%2fLabel%3e%0d%0a++++%3cValueType%3eNumeric%3c%2fValueType%3e%0d%0a++++%3cMultiRecordIndex+%2f%3e%0d%0a++%3c%2fCells%3e%0d%0a++%3cCells%3e%0d%0a++++%3cNameIndex%3e0%3c%2fNameIndex%3e%0d%0a++++%3cLabel%3eMT_Avg_3%3c%2fLabel%3e%0d%0a++++%3cValueType%3eNumeric%3c%2fValueType%3e%0d%0a++++%3cMultiRecordIndex+%2f%3e%0d%0a++%3c%2fCells%3e%0d%0a++%3cCells%3e%0d%0a++++%3cNameIndex%3e0%3c%2fNameIndex%3e%0d%0a++++%3cLabel%3eMT_Avg_4%3c%2fLabel%3e%0d%0a++++%3cValueType%3eNumeric%3c%2fValueType%3e%0d%0a++++%3cMultiRecordIndex+%2f%3e%0d%0a++%3c%2fCells%3e%0d%0a++%3cCells%3e%0d%0a++++%3cNameIndex%3e0%3c%2fNameIndex%3e%0d%0a++++%3cLabel%3eMT_Avg_5%3c%2fLabel%3e%0d%0a++++%3cValueType%3eNumeric%3c%2fValueType%3e%0d%0a++++%3cMultiRecordIndex+%2f%3e%0d%0a++%3c%2fCells%3e%0d%0a++%3cCells%3e%0d%0a++++%3cNameIndex%3e0%3c%2fNameIndex%3e%0d%0a++++%3cLabel%3eMT_Avg_6%3c%2fLabel%3e%0d%0a++++%3cValueType%3eNumeric%3c%2fValueType%3e%0d%0a++++%3cMultiRecordIndex+%2f%3e%0d%0a++%3c%2fCells%3e%0d%0a++%3cCells%3e%0d%0a++++%3cNameIndex%3e0%3c%2fNameIndex%3e%0d%0a++++%3cLabel%3eMT_Avg_7%3c%2fLabel%3e%0d%0a++++%3cValueType%3eNumeric%3c%2fValueType%3e%0d%0a++++%3cMultiRecordIndex+%2f%3e%0d%0a++%3c%2fCells%3e%0d%0a++%3cCells%3e%0d%0a++++%3cNameIndex%3e0%3c%2fNameIndex%3e%0d%0a++++%3cLabel%3eMT_Avg_8%3c%2fLabel%3e%0d%0a++++%3cValueType%3eNumeric%3c%2fValueType%3e%0d%0a++++%3cMultiRecordIndex+%2f%3e%0d%0a++%3c%2fCells%3e%0d%0a++%3cCells%3e%0d%0a++++%3cNameIndex%3e0%3c%2fNameIndex%3e%0d%0a++++%3cLabel%3eMT_Avg_9%3c%2fLabel%3e%0d%0a++++%3cValueType%3eNumeric%3c%2fValueType%3e%0d%0a++++%3cMultiRecordIndex+%2f%3e%0d%0a++%3c%2fCells%3e%0d%0a++%3cCells%3e%0d%0a++++%3cNameIndex%3e0%3c%2fNameIndex%3e%0d%0a++++%3cLabel%3eMT_Avg_10%3c%2fLabel%3e%0d%0a++++%3cValueType%3eNumeric%3c%2fValueType%3e%0d%0a++++%3cMultiRecordIndex+%2f%3e%0d%0a++%3c%2fCells%3e%0d%0a++%3cCells%3e%0d%0a++++%3cNameIndex%3e0%3c%2fNameIndex%3e%0d%0a++++%3cLabel%3eMT_Avg_11%3c%2fLabel%3e%0d%0a++++%3cValueType%3eNumeric%3c%2fValueType%3e%0d%0a++++%3cMultiRecordIndex+%2f%3e%0d%0a++%3c%2fCells%3e%0d%0a++%3cCells%3e%0d%0a++++%3cNameIndex%3e0%3c%2fNameIndex%3e%0d%0a++++%3cLabel%3eMT_Avg_12%3c%2fLabel%3e%0d%0a++++%3cValueType%3eNumeric%3c%2fValueType%3e%0d%0a++++%3cMultiRecordIndex+%2f%3e%0d%0a++%3c%2fCells%3e%0d%0a++%3cCells%3e%0d%0a++++%3cNameIndex%3e0%3c%2fNameIndex%3e%0d%0a++++%3cLabel%3eMT_Avg_13%3c%2fLabel%3e%0d%0a++++%3cValueType%3eNumeric%3c%2fValueType%3e%0d%0a++++%3cMultiRecordIndex+%2f%3e%0d%0a++%3c%2fCells%3e%0d%0a++%3cCells%3e%0d%0a++++%3cNameIndex%3e0%3c%2fNameIndex%3e%0d%0a++++%3cLabel%3eMT_Avg_14%3c%2fLabel%3e%0d%0a++++%3cValueType%3eNumeric%3c%2fValueType%3e%0d%0a++++%3cMultiRecordIndex+%2f%3e%0d%0a++%3c%2fCells%3e%0d%0a++%3cCells%3e%0d%0a++++%3cNameIndex%3e0%3c%2fNameIndex%3e%0d%0a++++%3cLabel%3eMT_Avg_15%3c%2fLabel%3e%0d%0a++++%3cValueType%3eNumeric%3c%2fValueType%3e%0d%0a++++%3cMultiRecordIndex+%2f%3e%0d%0a++%3c%2fCells%3e%0d%0a++%3cCells%3e%0d%0a++++%3cNameIndex%3e0%3c%2fNameIndex%3e%0d%0a++++%3cLabel%3eMT_Avg_16%3c%2fLabel%3e%0d%0a++++%3cValueType%3eNumeric%3c%2fValueType%3e%0d%0a++++%3cMultiRecordIndex+%2f%3e%0d%0a++%3c%2fCells%3e%0d%0a++%3cCells%3e%0d%0a++++%3cNameIndex%3e0%3c%2fNameIndex%3e%0d%0a++++%3cLabel%3eMT_Avg_17%3c%2fLabel%3e%0d%0a++++%3cValueType%3eNumeric%3c%2fValueType%3e%0d%0a++++%3cMultiRecordIndex+%2f%3e%0d%0a++%3c%2fCells%3e%0d%0a++%3cCells%3e%0d%0a++++%3cNameIndex%3e0%3c%2fNameIndex%3e%0d%0a++++%3cLabel%3eMT_Avg_18%3c%2fLabel%3e%0d%0a++++%3cValueType%3eNumeric%3c%2fValueType%3e%0d%0a++++%3cMultiRecordIndex+%2f%3e%0d%0a++%3c%2fCells%3e%0d%0a++%3cCells%3e%0d%0a++++%3cNameIndex%3e0%3c%2fNameIndex%3e%0d%0a++++%3cLabel%3eMT_Avg_19%3c%2fLabel%3e%0d%0a++++%3cValueType%3eNumeric%3c%2fValueType%3e%0d%0a++++%3cMultiRecordIndex+%2f%3e%0d%0a++%3c%2fCells%3e%0d%0a++%3cCells%3e%0d%0a++++%3cNameIndex%3e0%3c%2fNameIndex%3e%0d%0a++++%3cLabel%3eMT_Avg_20%3c%2fLabel%3e%0d%0a++++%3cValueType%3eNumeric%3c%2fValueType%3e%0d%0a++++%3cMultiRecordIndex+%2f%3e%0d%0a++%3c%2fCells%3e%0d%0a++%3cCells%3e%0d%0a++++%3cNameIndex%3e0%3c%2fNameIndex%3e%0d%0a++++%3cLabel%3eMT_Avg_21%3c%2fLabel%3e%0d%0a++++%3cValueType%3eNumeric%3c%2fValueType%3e%0d%0a++++%3cMultiRecordIndex+%2f%3e%0d%0a++%3c%2fCells%3e%0d%0a++%3cCells%3e%0d%0a++++%3cNameIndex%3e0%3c%2fNameIndex%3e%0d%0a++++%3cLabel%3eMT_Avg_22%3c%2fLabel%3e%0d%0a++++%3cValueType%3eNumeric%3c%2fValueType%3e%0d%0a++++%3cMultiRecordIndex+%2f%3e%0d%0a++%3c%2fCells%3e%0d%0a++%3cCells%3e%0d%0a++++%3cNameIndex%3e0%3c%2fNameIndex%3e%0d%0a++++%3cLabel%3eMT_Avg_23%3c%2fLabel%3e%0d%0a++++%3cValueType%3eNumeric%3c%2fValueType%3e%0d%0a++++%3cMultiRecordIndex+%2f%3e%0d%0a++%3c%2fCells%3e%0d%0a++%3cCells%3e%0d%0a++++%3cNameIndex%3e0%3c%2fNameIndex%3e%0d%0a++++%3cLabel%3eMT_Avg_24%3c%2fLabel%3e%0d%0a++++%3cValueType%3eNumeric%3c%2fValueType%3e%0d%0a++++%3cMultiRecordIndex+%2f%3e%0d%0a++%3c%2fCells%3e%0d%0a++%3cCells%3e%0d%0a++++%3cNameIndex%3e0%3c%2fNameIndex%3e%0d%0a++++%3cLabel%3eMT_Avg_25%3c%2fLabel%3e%0d%0a++++%3cValueType%3eNumeric%3c%2fValueType%3e%0d%0a++++%3cMultiRecordIndex+%2f%3e%0d%0a++%3c%2fCells%3e%0d%0a%3c%2fSavingCells%3e"]