{"text_format":"3","workbook":"xlsx","n_sheets":4,"sheets":["Score Tracker","Your Performance","Settings","Calculations"],"not_rendered":{"defined_names":3,"comments":1},"read":"whole","date_system":"1900"}

{"sheet":"Score Tracker","index":0,"n_rows":14,"n_cols":6,"rows_kept":14}
[null,"Enter Your Scores Here"]
[]
[null,null,"Class","Type","Description","Score"]
[null,null,"Modern French","Homework","WW II History",{"v":0.8,"d":"80%"}]
[null,null,"Advanced Programming in Java","Midterm",null,{"v":0.75,"d":"75%"}]
[null,null,"Spanish","Homework",null,{"v":0.5,"d":"50%"}]
[null,null,"Theoretical Physics","Homework",null,{"v":0.95,"d":"95%"}]
[null,null,"Modern French","Homework","WW I History",{"v":0.9,"d":"90%"}]
[null,null,"Modern French","Homework","Pages 30 - 41",{"v":0.8,"d":"80%"}]
[null,null,"Composition","Essay","Persuasion paper",{"v":0.95,"d":"95%"}]
[null,null,"Mathematics 1","Homework","Pages 21 & 26",{"v":0.8,"d":"80%"}]
[null,null,"Mathematics 2","Homework","Pages 15 & 18",{"v":0.85,"d":"85%"}]
[null,null,"Mathematics 1","Homework","Pages 34 - 36",{"v":0.8,"d":"80%"}]
[null,null,"Mathematics 2","Quiz",null,{"v":0.95,"d":"95%"}]

{"sheet":"Your Performance","index":1,"n_rows":31,"n_cols":8,"rows_kept":31}
[null,"Your Performance"]
[]
[null,null,"Totals"]
[null,null,{"$f":"\"Hours: \"&SUM(tblClasses[Credit Hours])","v":"Hours: 24"},{"$f":"AVERAGE(D7:D31)","v":{"v":0.8104761904761906,"d":"81%"}},{"$f":"AVERAGE(E7:E31)","v":{"v":2.7142857142857144,"d":"2.71"}},{"$f":"SUM(F7:F31)","v":{"v":2.625,"d":"2.63"}},{"$f":"IFERROR(HLOOKUP(D4,lstGPAMapping,2),\"\")","v":"B-"}]
[]
[null,null,"Classes","%","GPA","wGPA","Letter","Overall Performance"]
[null,null,{"$f":"Calculations!C6","v":"Modern French"},{"$f":"Calculations!AL6","v":{"v":0.8333333333333334,"d":"83%"}},{"$f":"Calculations!AM6","v":{"v":3,"d":"3.00"}},{"$f":"IFERROR(E7*Settings!D9/SUM(tblClasses[Credit Hours]),\"\")","v":{"v":0.375,"d":"0.38"}},{"$f":"Calculations!AN6","v":"B"}]
[null,null,{"$f":"Calculations!C7","v":"Theoretical Physics"},{"$f":"Calculations!AL7","v":{"v":0.95,"d":"95%"}},{"$f":"Calculations!AM7","v":{"v":4,"d":"4.00"}},{"$f":"IFERROR(E8*Settings!D10/SUM(tblClasses[Credit Hours]),\"\")","v":{"v":0.5,"d":"0.50"}},{"$f":"Calculations!AN7","v":"A"}]
[null,null,{"$f":"Calculations!C8","v":"Mathematics 1"},{"$f":"Calculations!AL8","v":{"v":0.8000000000000002,"d":"80%"}},{"$f":"Calculations!AM8","v":2.67},{"$f":"IFERROR(E9*Settings!D11/SUM(tblClasses[Credit Hours]),\"\")","v":{"v":0.445,"d":"0.45"}},{"$f":"Calculations!AN8","v":"B-"}]
[null,null,{"$f":"Calculations!C9","v":"Mathematics 2"},{"$f":"Calculations!AL9","v":{"v":0.89,"d":"89%"}},{"$f":"Calculations!AM9","v":3.33},{"$f":"IFERROR(E10*Settings!D12/SUM(tblClasses[Credit Hours]),\"\")","v":{"v":0.555,"d":"0.56"}},{"$f":"Calculations!AN9","v":"B+"}]
[null,null,{"$f":"Calculations!C10","v":"Advanced Programming in Java"},{"$f":"Calculations!AL10","v":{"v":0.7500000000000001,"d":"75%"}},{"$f":"Calculations!AM10","v":{"v":2,"d":"2.00"}},{"$f":"IFERROR(E11*Settings!D13/SUM(tblClasses[Credit Hours]),\"\")","v":{"v":0.4166666666666667,"d":"0.42"}},{"$f":"Calculations!AN10","v":"C"}]
[null,null,{"$f":"Calculations!C11","v":"Spanish"},{"$f":"Calculations!AL11","v":{"v":0.5,"d":"50%"}},{"$f":"Calculations!AM11","v":{"v":0,"d":"0.00"}},{"$f":"IFERROR(E12*Settings!D14/SUM(tblClasses[Credit Hours]),\"\")","v":{"v":0,"d":"0.00"}},{"$f":"Calculations!AN11","v":"F"}]
[null,null,{"$f":"Calculations!C12","v":"Composition"},{"$f":"Calculations!AL12","v":{"v":0.95,"d":"95%"}},{"$f":"Calculations!AM12","v":{"v":4,"d":"4.00"}},{"$f":"IFERROR(E13*Settings!D15/SUM(tblClasses[Credit Hours]),\"\")","v":{"v":0.3333333333333333,"d":"0.33"}},{"$f":"Calculations!AN12","v":"A"}]
[null,null,{"$f":"Calculations!C13","v":""},{"$f":"Calculations!AL13","v":""},{"$f":"Calculations!AM13","v":""},{"$f":"IFERROR(E14*Settings!D16/SUM(tblClasses[Credit Hours]),\"\")","v":""},{"$f":"Calculations!AN13","v":""}]
[null,null,{"$f":"Calculations!C14","v":""},{"$f":"Calculations!AL14","v":""},{"$f":"Calculations!AM14","v":""},{"$f":"IFERROR(E15*Settings!D17/SUM(tblClasses[Credit Hours]),\"\")","v":""},{"$f":"Calculations!AN14","v":""}]
{"$rows_left_out":17}
{"sheet":"Settings","index":2,"n_rows":15,"n_cols":16,"rows_kept":15,"merged":[[5,2,5,15]]}
[null,"Settings"]
[null,null,"Scores and GPA mapping"]
[null,null,"Percentage",{"v":0,"d":"0%"},{"v":0.6,"d":"60%"},{"v":0.63,"d":"63%"},{"v":0.67,"d":"67%"},{"v":0.7,"d":"70%"},{"v":0.73,"d":"73%"},{"v":0.77,"d":"77%"},{"v":0.8,"d":"80%"},{"v":0.83,"d":"83%"},{"v":0.87,"d":"87%"},{"v":0.9,"d":"90%"},{"v":0.93,"d":"93%"},{"v":0.97,"d":"97%"}]
[null,null,"Letter Grade","F","D-","D","D+","C-","C","C+","B-","B","B+","A-","A","A+"]
[null,null,"GPA",0,0.67,1,1.33,1.67,2,2.33,2.67,3,3.33,3.67,4,4]
[]
[null,null,"Weighted scores for up to 25 classes"]
[null,null,"Classes you are taking","Credit Hours","Homework","Essay","Quiz","Project","Midterm","Final Exam","Other","% Total"]
[null,null,"Modern French",{"v":3,"d":"3.0"},{"v":0.1,"d":"10%"},{"v":0.15,"d":"15%"},{"v":0.15,"d":"15%"},{"v":0.1,"d":"10%"},{"v":0.2,"d":"20%"},{"v":0.3,"d":"30%"},null,{"$f":"SUM(tblClasses[[#This Row],[Homework]:[Other]])","v":{"v":1,"d":"100%"}}]
[null,null,"Theoretical Physics",{"v":3,"d":"3.0"},{"v":0.15,"d":"15%"},{"v":0.15,"d":"15%"},{"v":0.1,"d":"10%"},{"v":0.1,"d":"10%"},{"v":0.15,"d":"15%"},{"v":0.3,"d":"30%"},{"v":0.05,"d":"5%"},{"$f":"SUM(tblClasses[[#This Row],[Homework]:[Other]])","v":{"v":1,"d":"100%"}}]
[null,null,"Mathematics 1",{"v":4,"d":"4.0"},{"v":0.1,"d":"10%"},{"v":0.15,"d":"15%"},{"v":0.15,"d":"15%"},{"v":0.1,"d":"10%"},{"v":0.2,"d":"20%"},{"v":0.3,"d":"30%"},null,{"$f":"SUM(tblClasses[[#This Row],[Homework]:[Other]])","v":{"v":1,"d":"100%"}}]
[null,null,"Mathematics 2",{"v":4,"d":"4.0"},{"v":0.15,"d":"15%"},{"v":0.15,"d":"15%"},{"v":0.1,"d":"10%"},{"v":0.1,"d":"10%"},{"v":0.15,"d":"15%"},{"v":0.3,"d":"30%"},{"v":0.05,"d":"5%"},{"$f":"SUM(tblClasses[[#This Row],[Homework]:[Other]])","v":{"v":1,"d":"100%"}}]
[null,null,"Advanced Programming in Java",{"v":5,"d":"5.0"},{"v":0.15,"d":"15%"},{"v":0.15,"d":"15%"},{"v":0.1,"d":"10%"},{"v":0.1,"d":"10%"},{"v":0.2,"d":"20%"},{"v":0.3,"d":"30%"},null,{"$f":"SUM(tblClasses[[#This Row],[Homework]:[Other]])","v":{"v":1,"d":"100%"}}]
[null,null,"Spanish",{"v":3,"d":"3.0"},{"v":0.1,"d":"10%"},{"v":0.15,"d":"15%"},{"v":0.17,"d":"17%"},{"v":0.13,"d":"13%"},{"v":0.2,"d":"20%"},{"v":0.2,"d":"20%"},{"v":0.05,"d":"5%"},{"$f":"SUM(tblClasses[[#This Row],[Homework]:[Other]])","v":{"v":1,"d":"100%"}}]
[null,null,"Composition",{"v":2,"d":"2.0"},{"v":0.15,"d":"15%"},{"v":0.15,"d":"15%"},{"v":0.12,"d":"12%"},{"v":0.15,"d":"15%"},{"v":0.15,"d":"15%"},{"v":0.25,"d":"25%"},{"v":0.03,"d":"3%"},{"$f":"SUM(tblClasses[[#This Row],[Homework]:[Other]])","v":{"v":1,"d":"100%"}}]
{"$rows_left_out":1}
{"sheet":"Calculations","index":3,"n_rows":657,"n_cols":40,"rows_kept":657,"hidden":true}
[null,"Calculations"]
[null,null,"This worksheet provides calculations for your grades & GPA and should remain hidden. Any changes to this sheet could result in errors."]
[]
[null,null,"Current Class List","Scores (out of 1)",{"$nulls":24},"Grade Calculation"]
[null,null,"Class",1,2,3,4,5,6,7,8,9,10,11,12,13,14,15,16,17,18,19,20,21,22,23,24,25,{"$f":"tblClasses[[#Headers],[Homework]]","v":"Homework"},{"$f":"tblClasses[[#Headers],[Essay]]","v":"Essay"},{"$f":"tblClasses[[#Headers],[Quiz]]","v":"Quiz"},{"$f":"tblClasses[[#Headers],[Project]]","v":"Project"},{"$f":"tblClasses[[#Headers],[Midterm]]","v":"Midterm"},{"$f":"tblClasses[[#Headers],[Final Exam]]","v":"Final Exam"},{"$f":"tblClasses[[#Headers],[Other]]","v":"Other"},"Total","Total Possible Points","Total %","Grade Point","Letter Grade"]
[null,null,{"$f":"IF(Settings!C9=\"\",\"\",Settings!C9)","v":"Modern French"},{"$f":"IFERROR(INDEX(tblClassScores[],MATCH($C6:$C30&D$5:AB$5,Calculations!$C$33:$C$657,0),4),\"\")","v":{"v":0.8,"d":"80%"}},{"v":0.9,"d":"90%"},{"v":0.8,"d":"80%"},"","","","","","","","","","","","","","","","","","","","","","",{"$f":"IFERROR(AVERAGEIFS(tblClassScores[Score],tblClassScores[Class],Calculations!$C6,tblClassScores[Type],Calculations!AC$5)*Settings!E9,\"\")","v":0.08333333333333334},{"$f":"IFERROR(AVERAGEIFS(tblClassScores[Score],tblClassScores[Class],Calculations!$C6,tblClassScores[Type],Calculations!AD$5)*Settings!F9,\"\")","v":""},{"$f":"IFERROR(AVERAGEIFS(tblClassScores[Score],tblClassScores[Class],Calculations!$C6,tblClassScores[Type],Calculations!AE$5)*Settings!G9,\"\")","v":""},{"$f":"IFERROR(AVERAGEIFS(tblClassScores[Score],tblClassScores[Class],Calculations!$C6,tblClassScores[Type],Calculations!AF$5)*Settings!H9,\"\")","v":""},{"$f":"IFERROR(AVERAGEIFS(tblClassScores[Score],tblClassScores[Class],Calculations!$C6,tblClassScores[Type],Calculations!AG$5)*Settings!I9,\"\")","v":""},{"$f":"IFERROR(AVERAGEIFS(tblClassScores[Score],tblClassScores[Class],Calculations!$C6,tblClassScores[Type],Calculations!AH$5)*Settings!J9,\"\")","v":""},{"$f":"IFERROR(AVERAGEIFS(tblClassScores[Score],tblClassScores[Class],Calculations!$C6,tblClassScores[Type],Calculations!AI$5)*Settings!K9,\"\")","v":""},{"$f":"SUM(AC6:AI6)","v":0.08333333333333334},{"$f":"SUMIFS(Settings!E9:K9,Calculations!AC6:AI6,\">0\")","v":0.1},{"$f":"IFERROR(AJ6/AK6,\"\")","v":{"v":0.8333333333333334,"d":"83%"}},{"$f":"IFERROR(HLOOKUP(AL6,lstGPAMapping,3),\"\")","v":3},{"$f":"IFERROR(HLOOKUP(AL6,lstGPAMapping,2),\"\")","v":"B"}]
[null,null,{"$f":"IF(Settings!C10=\"\",\"\",Settings!C10)","v":"Theoretical Physics"},{"v":0.95,"d":"95%"},"","","","","","","","","","","","","","","","","","","","","","","","",{"$f":"IFERROR(AVERAGEIFS(tblClassScores[Score],tblClassScores[Class],Calculations!$C7,tblClassScores[Type],Calculations!AC$5)*Settings!E10,\"\")","v":0.1425},{"$f":"IFERROR(AVERAGEIFS(tblClassScores[Score],tblClassScores[Class],Calculations!$C7,tblClassScores[Type],Calculations!AD$5)*Settings!F10,\"\")","v":""},{"$f":"IFERROR(AVERAGEIFS(tblClassScores[Score],tblClassScores[Class],Calculations!$C7,tblClassScores[Type],Calculations!AE$5)*Settings!G10,\"\")","v":""},{"$f":"IFERROR(AVERAGEIFS(tblClassScores[Score],tblClassScores[Class],Calculations!$C7,tblClassScores[Type],Calculations!AF$5)*Settings!H10,\"\")","v":""},{"$f":"IFERROR(AVERAGEIFS(tblClassScores[Score],tblClassScores[Class],Calculations!$C7,tblClassScores[Type],Calculations!AG$5)*Settings!I10,\"\")","v":""},{"$f":"IFERROR(AVERAGEIFS(tblClassScores[Score],tblClassScores[Class],Calculations!$C7,tblClassScores[Type],Calculations!AH$5)*Settings!J10,\"\")","v":""},{"$f":"IFERROR(AVERAGEIFS(tblClassScores[Score],tblClassScores[Class],Calculations!$C7,tblClassScores[Type],Calculations!AI$5)*Settings!K10,\"\")","v":""},{"$f":"SUM(AC7:AI7)","v":0.1425},{"$f":"SUMIFS(Settings!E10:K10,Calculations!AC7:AI7,\">0\")","v":0.15},{"$f":"IFERROR(AJ7/AK7,\"\")","v":{"v":0.95,"d":"95%"}},4,"A"]
[null,null,{"$f":"IF(Settings!C11=\"\",\"\",Settings!C11)","v":"Mathematics 1"},{"v":0.8,"d":"80%"},{"v":0.8,"d":"80%"},"","","","","","","","","","","","","","","","","","","","","","","",{"$f":"IFERROR(AVERAGEIFS(tblClassScores[Score],tblClassScores[Class],Calculations!$C8,tblClassScores[Type],Calculations!AC$5)*Settings!E11,\"\")","v":0.08000000000000002},{"$f":"IFERROR(AVERAGEIFS(tblClassScores[Score],tblClassScores[Class],Calculations!$C8,tblClassScores[Type],Calculations!AD$5)*Settings!F11,\"\")","v":""},{"$f":"IFERROR(AVERAGEIFS(tblClassScores[Score],tblClassScores[Class],Calculations!$C8,tblClassScores[Type],Calculations!AE$5)*Settings!G11,\"\")","v":""},{"$f":"IFERROR(AVERAGEIFS(tblClassScores[Score],tblClassScores[Class],Calculations!$C8,tblClassScores[Type],Calculations!AF$5)*Settings!H11,\"\")","v":""},{"$f":"IFERROR(AVERAGEIFS(tblClassScores[Score],tblClassScores[Class],Calculations!$C8,tblClassScores[Type],Calculations!AG$5)*Settings!I11,\"\")","v":""},{"$f":"IFERROR(AVERAGEIFS(tblClassScores[Score],tblClassScores[Class],Calculations!$C8,tblClassScores[Type],Calculations!AH$5)*Settings!J11,\"\")","v":""},{"$f":"IFERROR(AVERAGEIFS(tblClassScores[Score],tblClassScores[Class],Calculations!$C8,tblClassScores[Type],Calculations!AI$5)*Settings!K11,\"\")","v":""},0.08000000000000002,{"$f":"SUMIFS(Settings!E11:K11,Calculations!AC8:AI8,\">0\")","v":0.1},{"v":0.8000000000000002,"d":"80%"},2.67,"B-"]
[null,null,{"$f":"IF(Settings!C12=\"\",\"\",Settings!C12)","v":"Mathematics 2"},{"v":0.85,"d":"85%"},{"v":0.95,"d":"95%"},"","","","","","","","","","","","","","","","","","","","","","","",{"$f":"IFERROR(AVERAGEIFS(tblClassScores[Score],tblClassScores[Class],Calculations!$C9,tblClassScores[Type],Calculations!AC$5)*Settings!E12,\"\")","v":0.1275},{"$f":"IFERROR(AVERAGEIFS(tblClassScores[Score],tblClassScores[Class],Calculations!$C9,tblClassScores[Type],Calculations!AD$5)*Settings!F12,\"\")","v":""},{"$f":"IFERROR(AVERAGEIFS(tblClassScores[Score],tblClassScores[Class],Calculations!$C9,tblClassScores[Type],Calculations!AE$5)*Settings!G12,\"\")","v":0.095},{"$f":"IFERROR(AVERAGEIFS(tblClassScores[Score],tblClassScores[Class],Calculations!$C9,tblClassScores[Type],Calculations!AF$5)*Settings!H12,\"\")","v":""},{"$f":"IFERROR(AVERAGEIFS(tblClassScores[Score],tblClassScores[Class],Calculations!$C9,tblClassScores[Type],Calculations!AG$5)*Settings!I12,\"\")","v":""},{"$f":"IFERROR(AVERAGEIFS(tblClassScores[Score],tblClassScores[Class],Calculations!$C9,tblClassScores[Type],Calculations!AH$5)*Settings!J12,\"\")","v":""},{"$f":"IFERROR(AVERAGEIFS(tblClassScores[Score],tblClassScores[Class],Calculations!$C9,tblClassScores[Type],Calculations!AI$5)*Settings!K12,\"\")","v":""},0.2225,{"$f":"SUMIFS(Settings!E12:K12,Calculations!AC9:AI9,\">0\")","v":0.25},{"v":0.89,"d":"89%"},3.33,"B+"]
[null,null,{"$f":"IF(Settings!C13=\"\",\"\",Settings!C13)","v":"Advanced Programming in Java"},{"v":0.75,"d":"75%"},"","","","","","","","","","","","","","","","","","","","","","","","",{"$f":"IFERROR(AVERAGEIFS(tblClassScores[Score],tblClassScores[Class],Calculations!$C10,tblClassScores[Type],Calculations!AC$5)*Settings!E13,\"\")","v":""},{"$f":"IFERROR(AVERAGEIFS(tblClassScores[Score],tblClassScores[Class],Calculations!$C10,tblClassScores[Type],Calculations!AD$5)*Settings!F13,\"\")","v":""},{"$f":"IFERROR(AVERAGEIFS(tblClassScores[Score],tblClassScores[Class],Calculations!$C10,tblClassScores[Type],Calculations!AE$5)*Settings!G13,\"\")","v":""},{"$f":"IFERROR(AVERAGEIFS(tblClassScores[Score],tblClassScores[Class],Calculations!$C10,tblClassScores[Type],Calculations!AF$5)*Settings!H13,\"\")","v":""},{"$f":"IFERROR(AVERAGEIFS(tblClassScores[Score],tblClassScores[Class],Calculations!$C10,tblClassScores[Type],Calculations!AG$5)*Settings!I13,\"\")","v":0.15000000000000002},{"$f":"IFERROR(AVERAGEIFS(tblClassScores[Score],tblClassScores[Class],Calculations!$C10,tblClassScores[Type],Calculations!AH$5)*Settings!J13,\"\")","v":""},{"$f":"IFERROR(AVERAGEIFS(tblClassScores[Score],tblClassScores[Class],Calculations!$C10,tblClassScores[Type],Calculations!AI$5)*Settings!K13,\"\")","v":""},0.15000000000000002,{"$f":"SUMIFS(Settings!E13:K13,Calculations!AC10:AI10,\">0\")","v":0.2},{"v":0.7500000000000001,"d":"75%"},2,"C"]
[null,null,{"$f":"IF(Settings!C14=\"\",\"\",Settings!C14)","v":"Spanish"},{"v":0.5,"d":"50%"},"","","","","","","","","","","","","","","","","","","","","","","","",{"$f":"IFERROR(AVERAGEIFS(tblClassScores[Score],tblClassScores[Class],Calculations!$C11,tblClassScores[Type],Calculations!AC$5)*Settings!E14,\"\")","v":0.05},{"$f":"IFERROR(AVERAGEIFS(tblClassScores[Score],tblClassScores[Class],Calculations!$C11,tblClassScores[Type],Calculations!AD$5)*Settings!F14,\"\")","v":""},{"$f":"IFERROR(AVERAGEIFS(tblClassScores[Score],tblClassScores[Class],Calculations!$C11,tblClassScores[Type],Calculations!AE$5)*Settings!G14,\"\")","v":""},{"$f":"IFERROR(AVERAGEIFS(tblClassScores[Score],tblClassScores[Class],Calculations!$C11,tblClassScores[Type],Calculations!AF$5)*Settings!H14,\"\")","v":""},{"$f":"IFERROR(AVERAGEIFS(tblClassScores[Score],tblClassScores[Class],Calculations!$C11,tblClassScores[Type],Calculations!AG$5)*Settings!I14,\"\")","v":""},{"$f":"IFERROR(AVERAGEIFS(tblClassScores[Score],tblClassScores[Class],Calculations!$C11,tblClassScores[Type],Calculations!AH$5)*Settings!J14,\"\")","v":""},{"$f":"IFERROR(AVERAGEIFS(tblClassScores[Score],tblClassScores[Class],Calculations!$C11,tblClassScores[Type],Calculations!AI$5)*Settings!K14,\"\")","v":""},0.05,{"$f":"SUMIFS(Settings!E14:K14,Calculations!AC11:AI11,\">0\")","v":0.1},{"v":0.5,"d":"50%"},0,"F"]
[null,null,{"$f":"IF(Settings!C15=\"\",\"\",Settings!C15)","v":"Composition"},{"v":0.95,"d":"95%"},"","","","","","","","","","","","","","","","","","","","","","","","",{"$f":"IFERROR(AVERAGEIFS(tblClassScores[Score],tblClassScores[Class],Calculations!$C12,tblClassScores[Type],Calculations!AC$5)*Settings!E15,\"\")","v":""},{"$f":"IFERROR(AVERAGEIFS(tblClassScores[Score],tblClassScores[Class],Calculations!$C12,tblClassScores[Type],Calculations!AD$5)*Settings!F15,\"\")","v":0.1425},{"$f":"IFERROR(AVERAGEIFS(tblClassScores[Score],tblClassScores[Class],Calculations!$C12,tblClassScores[Type],Calculations!AE$5)*Settings!G15,\"\")","v":""},{"$f":"IFERROR(AVERAGEIFS(tblClassScores[Score],tblClassScores[Class],Calculations!$C12,tblClassScores[Type],Calculations!AF$5)*Settings!H15,\"\")","v":""},{"$f":"IFERROR(AVERAGEIFS(tblClassScores[Score],tblClassScores[Class],Calculations!$C12,tblClassScores[Type],Calculations!AG$5)*Settings!I15,\"\")","v":""},{"$f":"IFERROR(AVERAGEIFS(tblClassScores[Score],tblClassScores[Class],Calculations!$C12,tblClassScores[Type],Calculations!AH$5)*Settings!J15,\"\")","v":""},{"$f":"IFERROR(AVERAGEIFS(tblClassScores[Score],tblClassScores[Class],Calculations!$C12,tblClassScores[Type],Calculations!AI$5)*Settings!K15,\"\")","v":""},0.1425,{"$f":"SUMIFS(Settings!E15:K15,Calculations!AC12:AI12,\">0\")","v":0.15},{"v":0.95,"d":"95%"},4,"A"]
[null,null,{"$f":"IF(Settings!C16=\"\",\"\",Settings!C16)","v":""},"","","","","","","","","","","","","","","","","","","","","","","","","",{"$f":"IFERROR(AVERAGEIFS(tblClassScores[Score],tblClassScores[Class],Calculations!$C13,tblClassScores[Type],Calculations!AC$5)*Settings!E16,\"\")","v":""},{"$f":"IFERROR(AVERAGEIFS(tblClassScores[Score],tblClassScores[Class],Calculations!$C13,tblClassScores[Type],Calculations!AD$5)*Settings!F16,\"\")","v":""},{"$f":"IFERROR(AVERAGEIFS(tblClassScores[Score],tblClassScores[Class],Calculations!$C13,tblClassScores[Type],Calculations!AE$5)*Settings!G16,\"\")","v":""},{"$f":"IFERROR(AVERAGEIFS(tblClassScores[Score],tblClassScores[Class],Calculations!$C13,tblClassScores[Type],Calculations!AF$5)*Settings!H16,\"\")","v":""},{"$f":"IFERROR(AVERAGEIFS(tblClassScores[Score],tblClassScores[Class],Calculations!$C13,tblClassScores[Type],Calculations!AG$5)*Settings!I16,\"\")","v":""},{"$f":"IFERROR(AVERAGEIFS(tblClassScores[Score],tblClassScores[Class],Calculations!$C13,tblClassScores[Type],Calculations!AH$5)*Settings!J16,\"\")","v":""},{"$f":"IFERROR(AVERAGEIFS(tblClassScores[Score],tblClassScores[Class],Calculations!$C13,tblClassScores[Type],Calculations!AI$5)*Settings!K16,\"\")","v":""},0,{"$f":"SUMIFS(Settings!E16:K16,Calculations!AC13:AI13,\">0\")","v":0},"","",""]
[null,null,{"$f":"IF(Settings!C17=\"\",\"\",Settings!C17)","v":""},"","","","","","","","","","","","","","","","","","","","","","","","","",{"$f":"IFERROR(AVERAGEIFS(tblClassScores[Score],tblClassScores[Class],Calculations!$C14,tblClassScores[Type],Calculations!AC$5)*Settings!E17,\"\")","v":""},{"$f":"IFERROR(AVERAGEIFS(tblClassScores[Score],tblClassScores[Class],Calculations!$C14,tblClassScores[Type],Calculations!AD$5)*Settings!F17,\"\")","v":""},{"$f":"IFERROR(AVERAGEIFS(tblClassScores[Score],tblClassScores[Class],Calculations!$C14,tblClassScores[Type],Calculations!AE$5)*Settings!G17,\"\")","v":""},{"$f":"IFERROR(AVERAGEIFS(tblClassScores[Score],tblClassScores[Class],Calculations!$C14,tblClassScores[Type],Calculations!AF$5)*Settings!H17,\"\")","v":""},{"$f":"IFERROR(AVERAGEIFS(tblClassScores[Score],tblClassScores[Class],Calculations!$C14,tblClassScores[Type],Calculations!AG$5)*Settings!I17,\"\")","v":""},{"$f":"IFERROR(AVERAGEIFS(tblClassScores[Score],tblClassScores[Class],Calculations!$C14,tblClassScores[Type],Calculations!AH$5)*Settings!J17,\"\")","v":""},{"$f":"IFERROR(AVERAGEIFS(tblClassScores[Score],tblClassScores[Class],Calculations!$C14,tblClassScores[Type],Calculations!AI$5)*Settings!K17,\"\")","v":""},0,{"$f":"SUMIFS(Settings!E17:K17,Calculations!AC14:AI14,\">0\")","v":0},"","",""]
[null,null,{"$f":"IF(Settings!C18=\"\",\"\",Settings!C18)","v":""},"","","","","","","","","","","","","","","","","","","","","","","","","",{"$f":"IFERROR(AVERAGEIFS(tblClassScores[Score],tblClassScores[Class],Calculations!$C15,tblClassScores[Type],Calculations!AC$5)*Settings!E18,\"\")","v":""},{"$f":"IFERROR(AVERAGEIFS(tblClassScores[Score],tblClassScores[Class],Calculations!$C15,tblClassScores[Type],Calculations!AD$5)*Settings!F18,\"\")","v":""},{"$f":"IFERROR(AVERAGEIFS(tblClassScores[Score],tblClassScores[Class],Calculations!$C15,tblClassScores[Type],Calculations!AE$5)*Settings!G18,\"\")","v":""},{"$f":"IFERROR(AVERAGEIFS(tblClassScores[Score],tblClassScores[Class],Calculations!$C15,tblClassScores[Type],Calculations!AF$5)*Settings!H18,\"\")","v":""},{"$f":"IFERROR(AVERAGEIFS(tblClassScores[Score],tblClassScores[Class],Calculations!$C15,tblClassScores[Type],Calculations!AG$5)*Settings!I18,\"\")","v":""},{"$f":"IFERROR(AVERAGEIFS(tblClassScores[Score],tblClassScores[Class],Calculations!$C15,tblClassScores[Type],Calculations!AH$5)*Settings!J18,\"\")","v":""},{"$f":"IFERROR(AVERAGEIFS(tblClassScores[Score],tblClassScores[Class],Calculations!$C15,tblClassScores[Type],Calculations!AI$5)*Settings!K18,\"\")","v":""},0,{"$f":"SUMIFS(Settings!E18:K18,Calculations!AC15:AI15,\">0\")","v":0},"","",""]
{"$rows_left_out":642}